{"text_format":"1","workbook":"xlsx","n_sheets":6,"sheets":["Instructions","StudentData","Entry Sheet","Entry Sheet 2","EntrySheetLegalPage","Blank "],"not_rendered":{"charts":0,"images":3,"macros":1,"external_links":0,"defined_names":22,"comments":0,"pivot_tables":0},"unopened":[],"bounds":{"document_bytes":16777216,"sheet_cells":100000,"rows_first":2000,"rows_last":500,"rows_between":2000,"halvings":0,"cell_chars":16384,"cell_head_chars":4096},"cells_cut":0,"cells_raw":0,"read":"whole","date_system":"1900"}

{"sheet":"Instructions","index":0,"n_rows":72,"n_cols":10,"rows_kept":72,"cut":false,"hidden":false,"merged":[[0,0,0,1]]}
["spots Pwrm Brn leI jrUrI hdwieqW"]
[1,"ies Pwrm/XutIiltI nUM vrqx qoN pihlw swfI vYbswiet qoN nvIN Apfyt kwpI fwaUnlof kro[ho skdw quhwfy kol purwxw vrjn hovy[ "]
[2,"SrudentData Sheet ivc Awpxy skUl dw eIpMjwb portl qo ieport kIqw student Data kwpI krky pyst kro"]
[3,"Entry Sheet qy kilk kro[ qusI plYAr dw eIpMjwb AweI.fI Bro AYNytr dbwE"]
[4,"sbMDq plyAr dw fwtw njr Awvygw[ pMjwbI ivc nwm quhwnUM Awp Brny pYxgy["]
[5,"ieh Pwrm kMipaUtr/lYptwp qy shI vrk krygW ijs qy Ayksl Bwv AwiPs ieMsmtwl hovygW"]
[6,"quhwfy isstm ivc Anmol ilpI hoxI cwhIdI hY"]
[7,"hux qusI Kyf dw nwm nwl sYl qy jw ky islYkt kroo"]
[8,"ies qrHW aumr vrg, eIvyt/Bwr nUM islYkt kro"]
[9,"s`jy h`Q quhwnUM plyAr dI igxqI islYkt kro "]
{"$rows_left_out":63}
{"sheet":"StudentData","index":1,"n_rows":72,"n_cols":37,"rows_kept":72,"cut":false,"hidden":false,"merged":[]}
["Sno","Student ID","UdiseCode","Name","FatherName","MotherName","DOB","UID","EID","Gender","Class","Section","Stream","Trade","CasteCategory_Name","BPL","Disability","Religion_Name","Medium_Name","Height","Weight","Admission_No","Admission_Date","STATE_NAME","DISTRICT_NAME","Cur_Address","Village_Ward","Gram_Panchayat","Pin_Code","Roll_No","ContactNo","IFSCCode","BankName","Column1","AccountHolderCode","AccountHolder","AccountHolderName"]
[1,15522539,"03091005401","ABHI GAUTAM","SONU GAUTAM","MANORAMA DEVI","08-Aug-2019","933855699901",null,"Male","LKG","A",null,null,"General","No","No Disability","HINDU","Punjabi","90","17","100","12-May-2023","Punjab","LUDHIANA","rupalon","rupalon","rupalon","141421",null,"8284834317"]
[2,15176172,"03091005401","AVRAJ SINGH","GURPREET SINGH","RAVINDER KAUR","13-Jul-2019",null,null,"Male","LKG","A",null,null,"General","No","No Disability","SIKH","Punjabi","122","24","5513","01-Apr-2023","Punjab","LUDHIANA","VILLAGE RUPALON","RUPALON","RUPALON","141421",null,"8284834317"]
[3,15176254,"03091005401","DEEPINDER SINGH","VARINDER SINGH","JAGJIT KAUR","20-Oct-2019",null,null,"Male","LKG","A",null,null,"SC","No","No Disability","SIKH","Punjabi","125","27","5514","01-Apr-2023","Punjab","LUDHIANA","VILLAGE RUPALON","RUPALON","RUPALON","141421",null,"8284834317"]
[4,15176339,"03091005401","GURFATEH SINGH","PARMDEEP SINGH","MANPREET KAUR","02-Feb-2020",null,null,"Male","LKG","A",null,null,"General","No","No Disability","SIKH","Punjabi","125","26","5516","01-Apr-2023","Punjab","LUDHIANA","VILLAGE RUPALON","RUPALON","RUPALON","141421",null,"8284834317"]
[5,15175858,"03091005401","GURMANJOT KAUR","GURJOT SINGH","HARMANJOT KAUR","23-Feb-2020",null,null,"Female","LKG","A",null,null,"SC","No","No Disability","SIKH","Punjabi","119","24","5511","01-Apr-2023","Punjab","LUDHIANA","VILLAGE RUPALON","RUPALON","RUPALON","141421",null,"8284834317"]
[6,15176295,"03091005401","JASHANDEEP SINGH","MANPREET SINGH","SUKHDEEP KAUR","14-Nov-2019",null,null,"Male","LKG","A",null,null,"OBC","No","No Disability","SIKH","Punjabi","125","24","5515","01-Apr-2023","Punjab","LUDHIANA","VILLAGE RUPALON","RUPALON","RUPALON","141421",null,"8284834317"]
[7,15175775,"03091005401","NAVDEEP KAUR","DAVINDER SINGH","AMRIT KAUR","24-Nov-2019",null,null,"Female","LKG","A",null,null,"OBC","No","No Disability","SIKH","Punjabi","118","26","5508","01-Apr-2023","Punjab","LUDHIANA","VILLAGE RUPALON","RUPALON","RUPALON","141421",null,"8284834317"]
[8,15176208,"03091005401","SAMAR KHAN","RAJ DIN","RAJU","09-Sep-2019",null,null,"Male","LKG","A",null,null,"OBC","No","No Disability","MUSLIM","Punjabi","122","25","5513","01-Apr-2023","Punjab","LUDHIANA","VILLAGE RUPALON","RUPALON","RUPALON","141421",null,"8284834317"]
[9,15175825,"03091005401","SEHNOOR","IQBAL MOHAMAD","ROXI","07-Dec-2019",null,null,"Female","LKG","A",null,null,"OBC","No","No Disability","MUSLIM","Punjabi","125","28","5510","01-Apr-2023","Punjab","LUDHIANA","VILLAGE RUPALON","RUPALON","RUPALON","141421",null,"8284834317"]
{"$rows_left_out":63}
{"sheet":"Entry Sheet","index":2,"n_rows":43,"n_cols":20,"rows_kept":43,"cut":false,"hidden":false,"merged":[[40,0,40,3],[41,0,41,2],[14,13,15,13],[14,14,15,14],[14,15,15,15],[16,0,17,0],[16,1,17,1],[16,5,17,5],[16,6,17,6],[16,7,17,7],[16,8,17,8],[16,14,17,14],[16,15,17,15],[14,0,15,0],[14,1,15,1],[14,5,15,5],[14,6,15,6],[14,7,15,7],[18,0,19,0],[22,13,23,13],[22,14,23,14],[22,15,23,15],[24,0,25,0],[24,1,25,1],[0,0,0,14],[1,0,1,14],[2,0,2,15],[3,0,3,1],[3,2,3,4],[3,11,3,12],[4,10,4,11],[4,12,4,15],[39,0,39,15],[16,9,17,9],[16,10,17,10],[16,11,17,11],[16,12,17,12],[16,13,17,13],[14,8,15,8],[14,9,15,9],[14,10,15,10],[14,11,15,11],[14,12,15,12],[12,12,13,12],[12,13,13,13],[12,14,13,14],[12,15,13,15],[10,9,11,9],[12,0,13,0],[12,1,13,1],[12,5,13,5],[12,6,13,6],[12,7,13,7],[12,8,13,8],[12,9,13,9],[12,10,13,10],[12,11,13,11],[8,14,9,14],[8,15,9,15],[6,7,7,7],[10,0,11,0],[10,1,11,1],[10,5,11,5],[10,6,11,6],[10,7,11,7],[10,10,11,10],[10,11,11,11],[10,12,11,12],[10,13,11,13],[6,8,7,8],[10,8,11,8],[10,14,11,14],[10,15,11,15],[8,5,9,5],[8,6,9,6],[8,7,9,7],[8,8,9,8],[8,9,9,9],[8,10,9,10],[8,11,9,11],[8,12,9,12],[8,13,9,13],[18,1,19,1],[18,5,19,5],[18,6,19,6],[18,7,19,7],[6,14,7,14],[4,0,4,1],[41,11,41,15],[41,5,41,7],[41,8,41,10],[41,3,41,4],[40,8,40,12],[40,4,40,7],[6,9,7,9],[6,10,7,10],[6,11,7,11],[6,12,7,12],[6,13,7,13],[6,0,7,0],[6,1,7,1],[6,5,7,5],[6,6,7,6],[6,15,7,15],[8,0,9,0],[8,1,9,1],[22,6,23,6],[22,7,23,7],[18,13,19,13],[18,14,19,14],[18,15,19,15],[20,0,21,0],[20,1,21,1],[20,5,21,5],[20,6,21,6],[20,7,21,7],[20,8,21,8],[20,9,21,9],[20,10,21,10],[20,11,21,11],[20,12,21,12],[20,13,21,13],[20,14,21,14],[20,15,21,15],[18,8,19,8],[18,9,19,9],[18,10,19,10],[18,11,19,11],[18,12,19,12],[24,14,25,14],[24,15,25,15],[22,8,23,8],[22,9,23,9],[22,10,23,10],[22,11,23,11],[22,12,23,12],[22,0,23,0],[22,1,23,1],[22,5,23,5],[24,5,25,5],[24,6,25,6],[24,7,25,7],[24,8,25,8],[24,9,25,9],[24,10,25,10],[24,11,25,11],[24,12,25,12],[24,13,25,13],[26,8,27,8],[26,9,27,9],[26,10,27,10],[26,11,27,11],[26,12,27,12],[26,0,27,0],[26,1,27,1],[26,5,27,5],[26,6,27,6],[26,7,27,7],[28,7,29,7],[28,8,29,8],[28,9,29,9],[28,10,29,10],[28,11,29,11],[28,12,29,12],[28,13,29,13],[28,14,29,14],[28,15,29,15],[32,6,33,6],[32,7,33,7],[2,17,3,17],[1,18,3,18],[30,0,31,0],[30,1,31,1],[30,5,31,5],[30,6,31,6],[30,7,31,7],[30,8,31,8],[30,9,31,9],[30,10,31,10],[30,11,31,11],[30,12,31,12],[30,13,31,13],[30,14,31,14],[30,15,31,15],[26,13,27,13],[26,14,27,14],[26,15,27,15],[28,0,29,0],[28,1,29,1],[28,5,29,5],[28,6,29,6],[32,13,33,13],[32,14,33,14],[32,15,33,15],[34,0,35,0],[34,1,35,1],[34,5,35,5],[34,6,35,6],[34,7,35,7],[34,8,35,8],[34,9,35,9],[34,10,35,10],[34,11,35,11],[34,12,35,12],[34,13,35,13],[34,14,35,14],[34,15,35,15],[32,8,33,8],[32,9,33,9],[32,10,33,10],[32,11,33,11],[32,12,33,12],[32,0,33,0],[32,1,33,1],[32,5,33,5],[36,13,37,13],[36,14,37,14],[36,15,37,15],[36,8,37,8],[36,9,37,9],[36,10,37,10],[36,11,37,11],[36,12,37,12],[36,0,37,0],[36,1,37,1],[36,5,37,5],[36,6,37,6],[36,7,37,7]]}
["skUl is`iKAw  ivBwg,  pMjwb"]
["67vIAW  pMjwb  rwj  jon p`Dr  skUl KyfW  (luiDAwxw)  2023-24",null,null,null,null,null,null,null,null,null,null,null,null,null,null,null,null,null,10,"oooooou"]
["skUl dw  nwm:-srkwrI hweI skUl KMnw"]
["Kyf  dw  nwm:-",null,"ਰੱਸਾਕਸ਼ੀ",null,null,null,null,null,null,null,"imqI:- ",null,null,"qoN",null,"q`k"]
["aumr  vrg:- ",null,14,"ਲੜਕੇ",null,null,null,null,null,null,"Kyf  sQwn:"]
["lVI nM","sUtfYt AweIfI","iKfwrI  dw  nwm","ipqw  dw  nwm","mwqw  dw  nwm","ADwr  kwrf","SRyxI","jnm  imqI","dwKlw  nM","skUl  iv`c dwKl  hox dI  imqI","SRyxI  iv`c dwKl  hox dI  imqI","eIvYNt/ Bwr","ipCly  swl ikhVI Kyf/gru`p iv`c  Bwg\nilAw  hY","iKfwrI  dy Gr  dw p`kw  pqw","iKfwrI  dy dsqKq","qsdIk  Sudw  Poto"]
[1,null,null,null,null,{"$f":"IFERROR(VLOOKUP($B7,StudentData!$B$1:$AK$1014,7,0),\"\")","v":""},{"$f":"IFERROR(VLOOKUP($B7,StudentData!$B$1:$AK$1014,10,0),\"\")","v":""},{"$f":"IFERROR(VLOOKUP($B7,StudentData!$B$1:$AK$1014,6,0),\"\")","v":""},{"$f":"IFERROR(VLOOKUP($B7,StudentData!$B$1:$AK$1014,21,0),\"\")","v":""},{"$f":"IFERROR(VLOOKUP($B7,StudentData!$B$1:$AK$1014,22,0),\"\")","v":""},{"$f":"IFERROR(VLOOKUP($B7,StudentData!$B$1:$AK$1014,22,0),\"\")","v":""},null,null,{"$f":"IFERROR(VLOOKUP($B7,StudentData!$B$1:$AK$1014,25,0),\"\")","v":""}]
[null,null,{"$f":"IFERROR(VLOOKUP($B7,StudentData!$B$1:$AK$1014,3,0),\"\")","v":""},{"$f":"IFERROR(VLOOKUP($B7,StudentData!$B$1:$AK$1014,4,0),\"\")","v":""},{"$f":"IFERROR(VLOOKUP($B7,StudentData!$B$1:$AK$1014,5,0),\"\")","v":""}]
[2,null,null,null,null,{"$f":"IFERROR(VLOOKUP($B9,StudentData!$B$1:$AK$1014,7,0),\"\")","v":""},{"$f":"IFERROR(VLOOKUP($B9,StudentData!$B$1:$AK$1014,10,0),\"\")","v":""},{"$f":"IFERROR(VLOOKUP($B9,StudentData!$B$1:$AK$1014,6,0),\"\")","v":""},{"$f":"IFERROR(VLOOKUP($B9,StudentData!$B$1:$AK$1014,21,0),\"\")","v":""},{"$f":"IFERROR(VLOOKUP($B9,StudentData!$B$1:$AK$1014,22,0),\"\")","v":""},{"$f":"IFERROR(VLOOKUP($B9,StudentData!$B$1:$AK$1014,22,0),\"\")","v":""},null,null,{"$f":"IFERROR(VLOOKUP($B9,StudentData!$B$1:$AK$1014,25,0),\"\")","v":""}]
[null,null,{"$f":"IFERROR(VLOOKUP($B9,StudentData!$B$1:$AK$1014,3,0),\"\")","v":""},{"$f":"IFERROR(VLOOKUP($B9,StudentData!$B$1:$AK$1014,4,0),\"\")","v":""},{"$f":"IFERROR(VLOOKUP($B9,StudentData!$B$1:$AK$1014,5,0),\"\")","v":""}]
{"$rows_left_out":34}
{"sheet":"Entry Sheet 2","index":3,"n_rows":43,"n_cols":20,"rows_kept":43,"cut":false,"hidden":false,"merged":[[39,0,39,15],[40,0,40,3],[40,4,40,7],[40,8,40,12],[41,0,41,2],[41,3,41,4],[41,5,41,7],[41,8,41,10],[41,11,41,15],[34,12,35,12],[34,13,35,13],[34,14,35,14],[34,15,35,15],[36,0,37,0],[36,1,37,1],[36,5,37,5],[36,6,37,6],[36,7,37,7],[36,8,37,8],[36,15,37,15],[36,9,37,9],[36,10,37,10],[36,11,37,11],[36,12,37,12],[36,13,37,13],[36,14,37,14],[34,0,35,0],[34,1,35,1],[34,5,35,5],[34,6,35,6],[34,7,35,7],[34,8,35,8],[34,9,35,9],[34,10,35,10],[34,11,35,11],[30,12,31,12],[30,13,31,13],[30,14,31,14],[30,15,31,15],[32,0,33,0],[32,1,33,1],[32,5,33,5],[32,6,33,6],[32,7,33,7],[32,8,33,8],[32,15,33,15],[32,9,33,9],[32,10,33,10],[32,11,33,11],[32,12,33,12],[32,13,33,13],[32,14,33,14],[30,0,31,0],[30,1,31,1],[30,5,31,5],[30,6,31,6],[30,7,31,7],[30,8,31,8],[30,9,31,9],[30,10,31,10],[30,11,31,11],[26,12,27,12],[26,13,27,13],[26,14,27,14],[26,15,27,15],[28,0,29,0],[28,1,29,1],[28,5,29,5],[28,6,29,6],[28,7,29,7],[28,8,29,8],[28,15,29,15],[28,9,29,9],[28,10,29,10],[28,11,29,11],[28,12,29,12],[28,13,29,13],[28,14,29,14],[26,0,27,0],[26,1,27,1],[26,5,27,5],[26,6,27,6],[26,7,27,7],[26,8,27,8],[26,9,27,9],[26,10,27,10],[26,11,27,11],[22,12,23,12],[22,13,23,13],[22,14,23,14],[22,15,23,15],[24,0,25,0],[24,1,25,1],[24,5,25,5],[24,6,25,6],[24,7,25,7],[24,8,25,8],[24,15,25,15],[24,9,25,9],[24,10,25,10],[24,11,25,11],[24,12,25,12],[24,13,25,13],[24,14,25,14],[22,0,23,0],[22,1,23,1],[22,5,23,5],[22,6,23,6],[22,7,23,7],[22,8,23,8],[22,9,23,9],[22,10,23,10],[22,11,23,11],[18,12,19,12],[18,13,19,13],[18,14,19,14],[18,15,19,15],[20,0,21,0],[20,1,21,1],[20,5,21,5],[20,6,21,6],[20,7,21,7],[20,8,21,8],[20,15,21,15],[20,9,21,9],[20,10,21,10],[20,11,21,11],[20,12,21,12],[20,13,21,13],[20,14,21,14],[18,0,19,0],[18,1,19,1],[18,5,19,5],[18,6,19,6],[18,7,19,7],[18,8,19,8],[18,9,19,9],[18,10,19,10],[18,11,19,11],[14,12,15,12],[14,13,15,13],[14,14,15,14],[14,15,15,15],[16,0,17,0],[16,1,17,1],[16,5,17,5],[16,6,17,6],[16,7,17,7],[16,8,17,8],[16,15,17,15],[16,9,17,9],[16,10,17,10],[16,11,17,11],[16,12,17,12],[16,13,17,13],[16,14,17,14],[14,0,15,0],[14,1,15,1],[14,5,15,5],[14,6,15,6],[14,7,15,7],[14,8,15,8],[14,9,15,9],[14,10,15,10],[14,11,15,11],[10,14,11,14],[10,15,11,15],[12,0,13,0],[12,1,13,1],[12,5,13,5],[12,6,13,6],[12,7,13,7],[12,8,13,8],[12,15,13,15],[12,9,13,9],[12,10,13,10],[12,11,13,11],[12,12,13,12],[12,13,13,13],[12,14,13,14],[8,15,9,15],[10,0,11,0],[10,1,11,1],[10,5,11,5],[10,6,11,6],[10,7,11,7],[10,8,11,8],[10,9,11,9],[10,10,11,10],[10,11,11,11],[8,9,9,9],[8,10,9,10],[8,11,9,11],[8,12,9,12],[8,13,9,13],[8,14,9,14],[8,0,9,0],[8,1,9,1],[8,5,9,5],[8,6,9,6],[8,7,9,7],[8,8,9,8],[10,12,11,12],[10,13,11,13],[0,0,0,15],[1,0,1,15],[1,18,3,18],[2,0,2,15],[2,17,3,17],[3,0,3,1],[3,2,3,4],[3,11,3,12],[6,10,7,10],[6,11,7,11],[6,12,7,12],[6,13,7,13],[6,14,7,14],[6,15,7,15],[4,0,4,1],[4,10,4,11],[4,12,4,15],[6,0,7,0],[6,1,7,1],[6,5,7,5],[6,6,7,6],[6,7,7,7],[6,8,7,8],[6,9,7,9]]}
["skUl is`iKAw  ivBwg,  pMjwb"]
["67vIAW  pMjwb  rwj  jon p`Dr  skUl KyfW  (luiDAwxw)  2023-24",null,null,null,null,null,null,null,null,null,null,null,null,null,null,null,null,null,6,"oooooou"]
["skUl dw  nwm:-srkwrI hweI skUl KMnw"]
["Kyf  dw  nwm:-",null,"ਰੱਸਾਕਸ਼ੀ",null,null,null,null,null,null,null,"imqI:- ",null,null,"qoN",null,"q`k"]
["aumr  vrg:- ",null,14,"ਲੜਕੇ",null,null,null,null,null,null,"Kyf  sQwn:"]
["lVI nM","sUtfYt AweIfI","iKfwrI  dw  nwm","ipqw  dw  nwm","mwqw  dw  nwm","ADwr  kwrf","SRyxI","jnm  imqI","dwKlw  nM","skUl  iv`c dwKl  hox dI  imqI","SRyxI  iv`c dwKl  hox dI  imqI","eIvYNt/ Bwr","ipCly  swl ikhVI Kyf/gru`p iv`c  Bwg\nilAw  hY","iKfwrI  dy Gr  dw p`kw  pqw","iKfwrI  dy dsqKq","qsdIk  Sudw  Poto"]
[1,null,null,null,null,{"$f":"IFERROR(VLOOKUP($B7,StudentData!$B$1:$AK$1014,7,0),\"\")","v":""},{"$f":"IFERROR(VLOOKUP($B7,StudentData!$B$1:$AK$1014,10,0),\"\")","v":""},{"$f":"IFERROR(VLOOKUP($B7,StudentData!$B$1:$AK$1014,6,0),\"\")","v":""},{"$f":"IFERROR(VLOOKUP($B7,StudentData!$B$1:$AK$1014,21,0),\"\")","v":""},{"$f":"IFERROR(VLOOKUP($B7,StudentData!$B$1:$AK$1014,22,0),\"\")","v":""},{"$f":"IFERROR(VLOOKUP($B7,StudentData!$B$1:$AK$1014,22,0),\"\")","v":""},null,null,{"$f":"IFERROR(VLOOKUP($B7,StudentData!$B$1:$AK$1014,25,0),\"\")","v":""}]
[null,null,{"$f":"IFERROR(VLOOKUP($B7,StudentData!$B$1:$AK$1014,3,0),\"\")","v":""},{"$f":"IFERROR(VLOOKUP($B7,StudentData!$B$1:$AK$1014,4,0),\"\")","v":""},{"$f":"IFERROR(VLOOKUP($B7,StudentData!$B$1:$AK$1014,5,0),\"\")","v":""}]
[2,null,null,null,null,{"$f":"IFERROR(VLOOKUP($B9,StudentData!$B$1:$AK$1014,7,0),\"\")","v":""},{"$f":"IFERROR(VLOOKUP($B9,StudentData!$B$1:$AK$1014,10,0),\"\")","v":""},{"$f":"IFERROR(VLOOKUP($B9,StudentData!$B$1:$AK$1014,6,0),\"\")","v":""},{"$f":"IFERROR(VLOOKUP($B9,StudentData!$B$1:$AK$1014,21,0),\"\")","v":""},{"$f":"IFERROR(VLOOKUP($B9,StudentData!$B$1:$AK$1014,22,0),\"\")","v":""},{"$f":"IFERROR(VLOOKUP($B9,StudentData!$B$1:$AK$1014,22,0),\"\")","v":""},null,null,{"$f":"IFERROR(VLOOKUP($B9,StudentData!$B$1:$AK$1014,25,0),\"\")","v":""}]
[null,null,{"$f":"IFERROR(VLOOKUP($B9,StudentData!$B$1:$AK$1014,3,0),\"\")","v":""},{"$f":"IFERROR(VLOOKUP($B9,StudentData!$B$1:$AK$1014,4,0),\"\")","v":""},{"$f":"IFERROR(VLOOKUP($B9,StudentData!$B$1:$AK$1014,5,0),\"\")","v":""}]
{"$rows_left_out":34}
{"sheet":"EntrySheetLegalPage","index":4,"n_rows":42,"n_cols":19,"rows_kept":42,"cut":false,"hidden":false,"merged":[[40,14,40,15],[36,15,37,15],[39,0,39,15],[40,0,40,3],[40,4,40,7],[40,8,40,12],[41,0,41,2],[41,3,41,4],[41,5,41,7],[41,8,41,10],[41,11,41,15],[36,9,37,9],[36,10,37,10],[36,11,37,11],[36,12,37,12],[36,13,37,13],[36,14,37,14],[34,12,35,12],[34,13,35,13],[34,14,35,14],[34,15,35,15],[36,0,37,0],[36,1,37,1],[36,5,37,5],[36,6,37,6],[36,7,37,7],[36,8,37,8],[32,15,33,15],[34,0,35,0],[34,1,35,1],[34,5,35,5],[34,6,35,6],[34,7,35,7],[34,8,35,8],[34,9,35,9],[34,10,35,10],[34,11,35,11],[32,9,33,9],[32,10,33,10],[32,11,33,11],[32,12,33,12],[32,13,33,13],[32,14,33,14],[30,12,31,12],[30,13,31,13],[30,14,31,14],[30,15,31,15],[32,0,33,0],[32,1,33,1],[32,5,33,5],[32,6,33,6],[32,7,33,7],[32,8,33,8],[28,15,29,15],[30,0,31,0],[30,1,31,1],[30,5,31,5],[30,6,31,6],[30,7,31,7],[30,8,31,8],[30,9,31,9],[30,10,31,10],[30,11,31,11],[28,9,29,9],[28,10,29,10],[28,11,29,11],[28,12,29,12],[28,13,29,13],[28,14,29,14],[26,12,27,12],[26,13,27,13],[26,14,27,14],[26,15,27,15],[28,0,29,0],[28,1,29,1],[28,5,29,5],[28,6,29,6],[28,7,29,7],[28,8,29,8],[24,15,25,15],[26,0,27,0],[26,1,27,1],[26,5,27,5],[26,6,27,6],[26,7,27,7],[26,8,27,8],[26,9,27,9],[26,10,27,10],[26,11,27,11],[24,9,25,9],[24,10,25,10],[24,11,25,11],[24,12,25,12],[24,13,25,13],[24,14,25,14],[22,12,23,12],[22,13,23,13],[22,14,23,14],[22,15,23,15],[24,0,25,0],[24,1,25,1],[24,5,25,5],[24,6,25,6],[24,7,25,7],[24,8,25,8],[20,15,21,15],[22,0,23,0],[22,1,23,1],[22,5,23,5],[22,6,23,6],[22,7,23,7],[22,8,23,8],[22,9,23,9],[22,10,23,10],[22,11,23,11],[20,9,21,9],[20,10,21,10],[20,11,21,11],[20,12,21,12],[20,13,21,13],[20,14,21,14],[18,12,19,12],[18,13,19,13],[18,14,19,14],[18,15,19,15],[20,0,21,0],[20,1,21,1],[20,5,21,5],[20,6,21,6],[20,7,21,7],[20,8,21,8],[16,15,17,15],[18,0,19,0],[18,1,19,1],[18,5,19,5],[18,6,19,6],[18,7,19,7],[18,8,19,8],[18,9,19,9],[18,10,19,10],[18,11,19,11],[16,9,17,9],[16,10,17,10],[16,11,17,11],[16,12,17,12],[16,13,17,13],[16,14,17,14],[14,12,15,12],[14,13,15,13],[14,14,15,14],[14,15,15,15],[16,0,17,0],[16,1,17,1],[16,5,17,5],[16,6,17,6],[16,7,17,7],[16,8,17,8],[12,15,13,15],[14,0,15,0],[14,1,15,1],[14,5,15,5],[14,6,15,6],[14,7,15,7],[14,8,15,8],[14,9,15,9],[14,10,15,10],[14,11,15,11],[12,9,13,9],[12,10,13,10],[12,11,13,11],[12,12,13,12],[12,13,13,13],[12,14,13,14],[10,12,11,12],[10,13,11,13],[10,14,11,14],[10,15,11,15],[12,0,13,0],[12,1,13,1],[12,5,13,5],[12,6,13,6],[12,7,13,7],[12,8,13,8],[8,15,9,15],[10,0,11,0],[10,1,11,1],[10,5,11,5],[10,6,11,6],[10,7,11,7],[10,8,11,8],[10,9,11,9],[10,10,11,10],[10,11,11,11],[8,9,9,9],[8,10,9,10],[8,11,9,11],[8,12,9,12],[8,13,9,13],[8,14,9,14],[8,0,9,0],[8,1,9,1],[8,5,9,5],[8,6,9,6],[8,7,9,7],[8,8,9,8],[6,10,7,10],[6,11,7,11],[6,12,7,12],[6,13,7,13],[6,14,7,14],[6,15,7,15],[4,0,4,1],[4,10,4,11],[4,12,4,15],[6,0,7,0],[6,1,7,1],[6,5,7,5],[6,6,7,6],[6,7,7,7],[6,8,7,8],[6,9,7,9],[0,0,0,15],[1,0,1,15],[1,18,3,18],[2,0,2,15],[2,17,3,17],[3,0,3,1],[3,2,3,4],[3,11,3,12]]}
["skUl is`iKAw  ivBwg,  pMjwb"]
["67vIAW  pMjwb  rwj  jon p`Dr  skUl KyfW  (luiDAwxw)  2023-24",null,null,null,null,null,null,null,null,null,null,null,null,null,null,null,null,null,12]
["skUl dw  nwm:-srkwrI hweI skUl KMnw"]
["Kyf  dw  nwm:-",null,"ਰੱਸਾਕਸ਼ੀ",null,null,null,null,null,null,null,"imqI:- ",null,null,"qoN",null,"q`k"]
["aumr  vrg:- ",null,14,"ਲੜਕੇ",null,null,null,null,null,null,"Kyf  sQwn:"]
["lVI nM","sUtfYt AweIfI","iKfwrI  dw  nwm","ipqw  dw  nwm","mwqw  dw  nwm","ADwr  kwrf","SRyxI","jnm  imqI","dwKlw  nM","skUl  iv`c dwKl  hox dI  imqI","SRyxI  iv`c dwKl  hox dI  imqI","eIvYNt/ Bwr","ipCly  swl ikhVI Kyf/gru`p iv`c  Bwg\nilAw  hY","iKfwrI  dy Gr  dw p`kw  pqw","iKfwrI  dy dsqKq","qsdIk  Sudw  Poto"]
[1,15522539,null,null,null,{"$f":"IFERROR(VLOOKUP($B7,StudentData!$B$1:$AK$1014,7,0),\"\")","v":"933855699901"},{"$f":"IFERROR(VLOOKUP($B7,StudentData!$B$1:$AK$1014,10,0),\"\")","v":"LKG"},{"$f":"IFERROR(VLOOKUP($B7,StudentData!$B$1:$AK$1014,6,0),\"\")","v":"08-Aug-2019"},{"$f":"IFERROR(VLOOKUP($B7,StudentData!$B$1:$AK$1014,21,0),\"\")","v":"100"},{"$f":"IFERROR(VLOOKUP($B7,StudentData!$B$1:$AK$1014,22,0),\"\")","v":"12-May-2023"},{"$f":"IFERROR(VLOOKUP($B7,StudentData!$B$1:$AK$1014,22,0),\"\")","v":"12-May-2023"},null,null,{"$f":"IFERROR(VLOOKUP($B7,StudentData!$B$1:$AK$1014,25,0),\"\")","v":"rupalon"}]
[null,null,{"$f":"IFERROR(VLOOKUP($B7,StudentData!$B$1:$AK$1014,3,0),\"\")","v":"ABHI GAUTAM"},{"$f":"IFERROR(VLOOKUP($B7,StudentData!$B$1:$AK$1014,4,0),\"\")","v":"SONU GAUTAM"},{"$f":"IFERROR(VLOOKUP($B7,StudentData!$B$1:$AK$1014,5,0),\"\")","v":"MANORAMA DEVI"}]
[2,null,null,null,null,{"$f":"IFERROR(VLOOKUP($B9,StudentData!$B$1:$AK$1014,7,0),\"\")","v":""},{"$f":"IFERROR(VLOOKUP($B9,StudentData!$B$1:$AK$1014,10,0),\"\")","v":""},{"$f":"IFERROR(VLOOKUP($B9,StudentData!$B$1:$AK$1014,6,0),\"\")","v":""},{"$f":"IFERROR(VLOOKUP($B9,StudentData!$B$1:$AK$1014,21,0),\"\")","v":""},{"$f":"IFERROR(VLOOKUP($B9,StudentData!$B$1:$AK$1014,22,0),\"\")","v":""},{"$f":"IFERROR(VLOOKUP($B9,StudentData!$B$1:$AK$1014,22,0),\"\")","v":""},null,null,{"$f":"IFERROR(VLOOKUP($B9,StudentData!$B$1:$AK$1014,25,0),\"\")","v":""}]
[null,null,{"$f":"IFERROR(VLOOKUP($B9,StudentData!$B$1:$AK$1014,3,0),\"\")","v":""},{"$f":"IFERROR(VLOOKUP($B9,StudentData!$B$1:$AK$1014,4,0),\"\")","v":""},{"$f":"IFERROR(VLOOKUP($B9,StudentData!$B$1:$AK$1014,5,0),\"\")","v":""}]
{"$rows_left_out":33}
{"sheet":"Blank ","index":5,"n_rows":23,"n_cols":16,"rows_kept":23,"cut":false,"hidden":false,"merged":[[19,0,19,15],[20,0,20,3],[20,4,20,7],[20,8,20,12],[16,9,17,9],[16,10,17,10],[16,11,17,11],[16,12,17,12],[16,13,17,13],[16,14,17,14],[21,0,21,2],[21,3,21,4],[21,5,21,7],[21,8,21,10],[21,11,21,15],[14,12,15,12],[14,13,15,13],[14,14,15,14],[14,15,15,15],[16,0,17,0],[16,1,17,1],[16,5,17,5],[16,6,17,6],[16,7,17,7],[16,8,17,8],[16,15,17,15],[14,8,15,8],[14,9,15,9],[14,10,15,10],[14,11,15,11],[12,11,13,11],[14,0,15,0],[14,1,15,1],[14,5,15,5],[14,6,15,6],[14,7,15,7],[10,12,11,12],[10,13,11,13],[10,14,11,14],[10,15,11,15],[12,0,13,0],[12,1,13,1],[12,5,13,5],[12,6,13,6],[12,7,13,7],[12,8,13,8],[12,15,13,15],[12,12,13,12],[12,13,13,13],[12,14,13,14],[12,9,13,9],[12,10,13,10],[8,15,9,15],[10,0,11,0],[10,1,11,1],[10,5,11,5],[10,6,11,6],[10,7,11,7],[10,8,11,8],[10,9,11,9],[10,10,11,10],[10,11,11,11],[8,9,9,9],[8,10,9,10],[8,11,9,11],[8,12,9,12],[8,13,9,13],[8,14,9,14],[8,0,9,0],[8,1,9,1],[8,5,9,5],[8,6,9,6],[8,7,9,7],[8,8,9,8],[6,10,7,10],[6,11,7,11],[6,12,7,12],[6,13,7,13],[6,14,7,14],[6,15,7,15],[4,0,4,1],[4,10,4,11],[4,12,4,15],[6,0,7,0],[6,1,7,1],[6,5,7,5],[6,6,7,6],[6,7,7,7],[6,8,7,8],[6,9,7,9],[0,0,0,14],[1,0,1,14],[2,0,2,15],[3,0,3,1],[3,2,3,4],[3,11,3,12]]}
["skUl is`iKAw  ivBwg,  pMjwb"]
["67vIAW  pMjwb  rwj  jon p`Dr  skUl KyfW  (luiDAwxw)  2023-24"]
["skUl dw  nwm:-srkwrI hweI skUl KMnw"]
["Kyf  dw  nwm:-",null,null,null,null,null,null,null,null,null,"imqI:- ",null,null,"qoN",null,"q`k"]
["aumr  vrg:- ",null,14,"ਲੜਕੇ",null,null,null,null,null,null,"Kyf  sQwn:"]
["lVI nM","sUtfYt AweIfI","iKfwrI  dw  nwm","ipqw  dw  nwm","mwqw  dw  nwm","ADwr  kwrf","SRyxI","jnm  imqI","dwKlw  nM","skUl  iv`c dwKl  hox dI  imqI","SRyxI  iv`c dwKl  hox dI  imqI","eIvYNt/ Bwr","ipCly  swl ikhVI Kyf/gru`p iv`c  Bwg\nilAw  hY","iKfwrI  dy Gr  dw p`kw  pqw","iKfwrI  dy dsqKq","qsdIk  Sudw  Poto"]
[1]
[]
[2]
[]
{"$rows_left_out":13}