{"text_format":"1","workbook":"xlsx","n_sheets":6,"sheets":["Instructions","StudentData","Entry Sheet","Entry Sheet 2","EntrySheetLegalPage","Blank "],"not_rendered":{"charts":0,"images":3,"macros":1,"external_links":0,"defined_names":22,"comments":0,"pivot_tables":0},"unopened":[],"bounds":{"document_bytes":16777216,"sheet_cells":100000,"rows_first":2000,"rows_last":500,"rows_between":2000,"halvings":0,"cell_chars":16384,"cell_head_chars":4096},"cells_cut":0,"cells_raw":0,"read":"whole","date_system":"1900"}

{"sheet":"Instructions","index":0,"n_rows":72,"n_cols":10,"rows_kept":72,"cut":false,"hidden":false,"merged":[[0,0,0,1]]}
["spots Pwrm Brn leI jrUrI hdwieqW"]
[1,"ies Pwrm/XutIiltI nUM vrqx qoN pihlw swfI vYbswiet qoN nvIN Apfyt kwpI fwaUnlof kro[ho skdw quhwfy kol purwxw vrjn hovy[ "]
[2,"SrudentData Sheet ivc Awpxy skUl dw eIpMjwb portl qo ieport kIqw student Data kwpI krky pyst kro"]
[3,"Entry Sheet qy kilk kro[ qusI plYAr dw eIpMjwb AweI.fI Bro AYNytr dbwE"]
[4,"sbMDq plyAr dw fwtw njr Awvygw[ pMjwbI ivc nwm quhwnUM Awp Brny pYxgy["]
[5,"ieh Pwrm kMipaUtr/lYptwp qy shI vrk krygW ijs qy Ayksl Bwv AwiPs ieMsmtwl hovygW"]
[6,"quhwfy isstm ivc Anmol ilpI hoxI cwhIdI hY"]
[7,"hux qusI Kyf dw nwm nwl sYl qy jw ky islYkt kroo"]
[8,"ies qrHW aumr vrg, eIvyt/Bwr nUM islYkt kro"]
[9,"s`jy h`Q quhwnUM plyAr dI igxqI islYkt kro "]
[10,"Next Record btn qy kil`k krky Agly iKfwrI dw fwtw dyK skdy ho["]
[11,"jykr iksy iKfwrI dw fwtw nhI idKw irhW qW StudentData Sheet qy jw ky Bry fwty nUM ircYk kro jI"]
[12,"ies dy nwl hr jwxkrI leI swfy Xuitaub cYnl qy jwky jwxkwrI lY skdy ho"]
[13,"Awpxy suJwA dyx leI swfI eImyl AweI.fI qy abhi072011@gmail.com myl kr skdy hO"]
[14,"iesy qrHW dy hor swPtvyAr fwaunlof krn leI swfI vYbswiet nUM ivijt kor"]
[15,"mihkmy dIAW myn surKIAW/ jwxkwrI leI swfw Pys bu`k puj lwiek kor "]
[]
[16,"https://shorturl.at/cuyEL"]
[null,"English  qoN pMjwbI ivc nwm tRWslyt krn leI ies ilMk nUM kwpI krky krom jW hor bRwaujr dI ivMfO ivc pyst kro"]
[null,"iqAwr krqw:- M.S. Manku  (Khanna)"]
[]
[]
[]
[]
[]
[]
[]
[]
[]
[]
[]
[null,"Game Name","GameNoEvent","Under","Boys/Girls",null,"ਰੱਸਾਕਸ਼ੀ"]
[null,"ਐਥਲੈਟਿਕਸ","ਹੈਂਡਬਾਲ",14,"ਲੜਕੇ",null,25]
[null,"ਬੈਡਮਿੰਟਨ ","ਬੈਡਮਿੰਟਨ ",17,"ਲੜਕੀਆਂ",null,26]
[null,"ਬਾਸਕਟਬਾਲ","ਬਾਸਕਟਬਾਲ",19,null,null,27]
[null,"ਮੁੱਕੇਬਾਜ਼ੀ","ਕ੍ਰਿਕੇਟ",null,null,null,28]
[null,"ਕ੍ਰਿਕੇਟ","ਸਾਈਕਲਿੰਗ",null,null,null,29]
[null,"ਸਾਈਕਲਿੰਗ","ਫੁੱਟਬਾਲ",null,null,null,30]
[null,"ਫੁੱਟਬਾਲ","ਹਾਕੀ ",null,null,null,31]
[null,"ਹਾਕੀ ","ਟੇਬਲ ਟੈਨਿਸ",null,null,null,32]
[null,"ਟੇਬਲ ਟੈਨਿਸ","ਟੈਨਿਸ",null,null,null,33]
[null,"ਟੈਨਿਸ","ਵਾਲੀਬਾਲ",null,null,null,34]
[null,"ਵਾਲੀਬਾਲ",null,null,null,null,35]
[null,"ਵੇਟ ਲਿਫਟਿੰਗ",null,null,null,null,36]
[null,"ਹੈਂਡਬਾਲ",null,null,null,null,37]
[null,"ਕੁਸ਼ਤੀ ( ਫ੍ਰੀ ਸਟਾਈਲ)",null,null,null,null,38]
[null,"ਕੁਸ਼ਤੀ (ਗ੍ਰੀਕ ਰੋਮਨ )",null,null,null,null,39]
[null,"ਰੱਸਾਕਸ਼ੀ",null,null,null,null,40]
[null,"ਤੈਰਾਕੀ",null,null,null,null,41]
[null,"ਐਥਲੈਟਿਕਸ","ਮੁੱਕੇਬਾਜ਼ੀ","ਬੈਡਮਿੰਟਨ ","ਵੇਟ ਲਿਫਟਿੰਗ",null,42]
[null,"ਰੇਸ 100ਮੀ.","28-30KG","NA","30KG",null,43]
[null,"ਰੇਸ 200ਮੀ.","30-32 KG",null,"35KG",null,44]
[null,"ਰੇਸ 400ਮੀ.","32-34 KG",null,"40KG",null,45]
[null,"ਰੇਸ 800ਮੀ.","34-36 KG",null,"45KG",null,46]
[null,"ਰੇਸ 1500ਮੀ.","36-38 KG",null,"49KG",null,47]
[null,"ਰੇਸ 3000ਮੀ.","38-40 KG",null,"55KG",null,48]
[null,"ਰੇਸ 5000ਮੀ.","40-42 KG",null,"59KG",null,49]
[null,"ਰਿਲੇਅ ਰੇਸ 4X100ਮੀ.","42-44 KG",null,"61KG",null,50]
[null,"ਰਿਲੇਅ ਰੇਸ 4X400ਮੀ.","44-46 KG",null,"64KG",null,51]
[null,"ਹਾਈ ਜੰਪ","46-48 KG",null,"67KG",null,52]
[null,"ਲੌਂਗ ਜੰਪ","48-50 KG",null,"71KG",null,53]
[null,"ਟ੍ਰਿਪਲ ਜੰਪ",null,null,"73KG",null,54]
[null,"ਜੈਵਲਿਨ ਥ੍ਰੋ",null,null,"76KG",null,55]
[null,"ਡਿਸਕਸ ਥ੍ਰੋ",null,null,"81KG",null,56]
[null,"ਹੈਮਰ ਥ੍ਰੋ",null,null,"87KG",null,57]
[null,"ਸ਼ਾਟ ਪੁਟ",null,null,"89KG",null,58]
[null,"ਹਰਡਲ 400ਮੀ.",null,null,"96KG",null,59]
[null,"ਹਰਡਲ 110ਮੀ.",null,null,"102KG",null,60]
[null,null,null,null,"81+KG",null,61]
[null,null,null,null,"102+KG",null,62]
[null,"ਬਾਸਕਟਬਾਲ","ਕ੍ਰਿਕੇਟ","ਸਾਈਕਲਿੰਗ","ਫੁੱਟਬਾਲ","ਹਾਕੀ ","ਟੇਬਲ ਟੈਨਿਸ","ਟੈਨਿਸ","ਵਾਲੀਬਾਲ","ਹੈਂਡਬਾਲ"]
[null,"NA","NA","NA","NA","NA","NA","NA","NA","NA"]

{"sheet":"StudentData","index":1,"n_rows":72,"n_cols":37,"rows_kept":72,"cut":false,"hidden":false,"merged":[]}
["Sno","Student ID","UdiseCode","Name","FatherName","MotherName","DOB","UID","EID","Gender","Class","Section","Stream","Trade","CasteCategory_Name","BPL","Disability","Religion_Name","Medium_Name","Height","Weight","Admission_No","Admission_Date","STATE_NAME","DISTRICT_NAME","Cur_Address","Village_Ward","Gram_Panchayat","Pin_Code","Roll_No","ContactNo","IFSCCode","BankName","Column1","AccountHolderCode","AccountHolder","AccountHolderName"]
[1,15522539,"03091005401","ABHI GAUTAM","SONU GAUTAM","MANORAMA DEVI","08-Aug-2019","933855699901",null,"Male","LKG","A",null,null,"General","No","No Disability","HINDU","Punjabi","90","17","100","12-May-2023","Punjab","LUDHIANA","rupalon","rupalon","rupalon","141421",null,"8284834317"]
[2,15176172,"03091005401","AVRAJ SINGH","GURPREET SINGH","RAVINDER KAUR","13-Jul-2019",null,null,"Male","LKG","A",null,null,"General","No","No Disability","SIKH","Punjabi","122","24","5513","01-Apr-2023","Punjab","LUDHIANA","VILLAGE RUPALON","RUPALON","RUPALON","141421",null,"8284834317"]
[3,15176254,"03091005401","DEEPINDER SINGH","VARINDER SINGH","JAGJIT KAUR","20-Oct-2019",null,null,"Male","LKG","A",null,null,"SC","No","No Disability","SIKH","Punjabi","125","27","5514","01-Apr-2023","Punjab","LUDHIANA","VILLAGE RUPALON","RUPALON","RUPALON","141421",null,"8284834317"]
[4,15176339,"03091005401","GURFATEH SINGH","PARMDEEP SINGH","MANPREET KAUR","02-Feb-2020",null,null,"Male","LKG","A",null,null,"General","No","No Disability","SIKH","Punjabi","125","26","5516","01-Apr-2023","Punjab","LUDHIANA","VILLAGE RUPALON","RUPALON","RUPALON","141421",null,"8284834317"]
[5,15175858,"03091005401","GURMANJOT KAUR","GURJOT SINGH","HARMANJOT KAUR","23-Feb-2020",null,null,"Female","LKG","A",null,null,"SC","No","No Disability","SIKH","Punjabi","119","24","5511","01-Apr-2023","Punjab","LUDHIANA","VILLAGE RUPALON","RUPALON","RUPALON","141421",null,"8284834317"]
[6,15176295,"03091005401","JASHANDEEP SINGH","MANPREET SINGH","SUKHDEEP KAUR","14-Nov-2019",null,null,"Male","LKG","A",null,null,"OBC","No","No Disability","SIKH","Punjabi","125","24","5515","01-Apr-2023","Punjab","LUDHIANA","VILLAGE RUPALON","RUPALON","RUPALON","141421",null,"8284834317"]
[7,15175775,"03091005401","NAVDEEP KAUR","DAVINDER SINGH","AMRIT KAUR","24-Nov-2019",null,null,"Female","LKG","A",null,null,"OBC","No","No Disability","SIKH","Punjabi","118","26","5508","01-Apr-2023","Punjab","LUDHIANA","VILLAGE RUPALON","RUPALON","RUPALON","141421",null,"8284834317"]
[8,15176208,"03091005401","SAMAR KHAN","RAJ DIN","RAJU","09-Sep-2019",null,null,"Male","LKG","A",null,null,"OBC","No","No Disability","MUSLIM","Punjabi","122","25","5513","01-Apr-2023","Punjab","LUDHIANA","VILLAGE RUPALON","RUPALON","RUPALON","141421",null,"8284834317"]
[9,15175825,"03091005401","SEHNOOR","IQBAL MOHAMAD","ROXI","07-Dec-2019",null,null,"Female","LKG","A",null,null,"OBC","No","No Disability","MUSLIM","Punjabi","125","28","5510","01-Apr-2023","Punjab","LUDHIANA","VILLAGE RUPALON","RUPALON","RUPALON","141421",null,"8284834317"]
[10,15175702,"03091005401","VARSHA","NIRMAL SINGH","KAVITA DEVI","26-Aug-2019",null,null,"Female","LKG","A",null,null,"SC","No","No Disability","SIKH","Punjabi","120","20","5507","01-Apr-2023","Punjab","LUDHIANA","VILLAGE RUPALON","RUPALON","RUPALON","141421",null,"8284834317"]
[11,14798270,"03091005401","ARJUNVEER SINGH","KARMVEER SINGH","AMANDEEP KAUR","14-Jul-2018",null,null,"Male","UKG","A",null,null,"OBC","No","No Disability","SIKH","Punjabi","85","12","4","01-Apr-2022","Punjab","LUDHIANA","rupalon","rupalon","rupalon","141416",null,"8439100008"]
[12,15035724,"03091005401","BHAVYA","RAJINDER SINGH","KIRAN RANI","30-Nov-2019",null,null,"Female","UKG","A",null,null,"General","No","No Disability","HINDU","Punjabi","123","10","1","17-Mar-2023","Punjab","LUDHIANA","Vill Rupalon","Vill Rupalon","Vill Rupalon","141421",null,"8437813754"]
[13,14797449,"03091005401","HAFIZA","HAKIMDIN","MANISHA","24-Apr-2018",null,null,"Female","UKG","A",null,null,"General","Yes","No Disability","MUSLIM","Punjabi","85","10","1","01-Apr-2022","Punjab","LUDHIANA","Rupalon","Rupalon","Rupalon","141416","1","8284834317"]
[14,14798279,"03091005401","KULJOT SINGH","LAKHVEER SINGH","RAJDEEP KAUR","18-Oct-2018",null,null,"Male","UKG","A",null,null,"OBC","No","No Disability","SIKH","Punjabi","84","12","5","10-Apr-2022","Punjab","LUDHIANA","rupalon","rupalon","rupalon","141416","5","8195035016"]
[15,14798291,"03091005401","MANKIRAT SINGH","RAJDEEP SINGH","BALWINDER KAUR","16-Jan-2019",null,null,"Male","UKG","A",null,null,"SC","No","No Disability","SIKH","Punjabi","85","12","6","01-Apr-2022","Punjab","LUDHIANA","rupalon","rupalon","rupalon","141416","6","8439100008"]
[16,14798259,"03091005401","PRABHJOT KAUR","PARMINDER SINGH","JASDEEP KAUR","25-Mar-2019",null,null,"Female","UKG","A",null,null,"General","No","No Disability","SIKH","Punjabi","85","11","3","01-Apr-2022","Punjab","LUDHIANA","rupalon","rupalon","rupalon","141416",null,"8284834317"]
[17,15176022,"03091005401","ROSHANPREET SINGH","JAGGI SINGH","PALWINDER KAUR","03-Oct-2018",null,null,"Male","UKG","A",null,null,"SC","No","No Disability","SIKH","Punjabi","126","24","5509","01-Apr-2023","Punjab","LUDHIANA","VILLAGE RUPALON","RUPALON","RUPALON","141421",null,"8284834317"]
[18,15481615,"03091005401","SIYUTU","DIPAK","CHAHITA DEVI","28-Nov-2017","914404910833",null,"Female","UKG","A",null,null,"General","No","No Disability","HINDU","Punjabi","92","20","101","10-May-2023","Punjab","LUDHIANA","rupalon","rupalon","rupalon","141421",null,"8284834317"]
[19,15522367,"03091005401","SUSHMITA","SHIV SAGAR","RADHIKA","18-Aug-2017","747537008494",null,"Female","UKG","A",null,null,"General","No","No Disability","HINDU","Punjabi","92","20","102","19-May-2023","Punjab","LUDHIANA","rupalon","rupalon","rupalon","141421",null,"8284834317"]
[20,15480899,"03091005401","ADITYA SINGH","SONU GAUTAM","MANORAMA DEVI","20-Jan-2018","592965122127",null,"Male","1st","A",null,null,"General","No","No Disability","HINDU","Punjabi","110","22","5517","10-May-2023","Punjab","LUDHIANA","rupalon","rupalon","rupalon","141421",null,"8437307135"]
[21,15481680,"03091005401","ANKESH","RAJESHWAR","GYANADEVI","25-Sep-2016",null,null,"Male","1st","A",null,null,"General","No","No Disability","HINDU","Punjabi","100","20","5520","10-May-2023","Punjab","LUDHIANA","rupalon","rupalon","rupalon","141421",null,"8284834317"]
[22,13614963,"03091005401","EKAMJOT KAUR","AMANDEEP SINGH","NAVPREET KAUR","03-Apr-2018",null,null,"Female","1st","A",null,null,"OBC","No","No Disability","SIKH","Punjabi","66","18","39","03-May-2021","Punjab","LUDHIANA","Rupalon","Rupalon","Rupalon","141421","03","9915493929"]
[23,13689327,"03091005401","GURKIRAT SINGH","GURTEJ SINGH","LOVEPREET","05-Feb-2018","766741240690",null,"Male","1st","A",null,null,"SC","No","No Disability","SIKH","Punjabi","65","20","41","20-May-2021","Punjab","LUDHIANA","Rupalon","Rupalon","Rupalon","141421","05","9873320214"]
[24,13487304,"03091005401","KHUSHAL SINGH","PAVITTER SINGH","KAUSHYALA","13-Mar-2018",null,null,"Male","1st","A",null,null,"General","No","No Disability","HINDU","Punjabi","66","12","34","19-Apr-2021","Punjab","LUDHIANA","RUPALON","RUPALON","RUPALON","141421","2","8146590501"]
[25,13689088,"03091005401","VANSHIKA","DHARAMPAL","POOJA DEVI","22-Mar-2018",null,null,"Female","1st","A",null,null,"General","No","No Disability","HINDU","Punjabi","65","18","40","20-May-2021","Punjab","LUDHIANA","Rupalon","Rupalon","Rupalon","141421","04","8727863392"]
[26,14177994,"03091005401","AMIT KUMAR","PRADEEP KUMAR SAH","RAMITA DEVI","05-Mar-2015",null,null,"Male","2nd","A",null,null,"General","No","No Disability","HINDU","Punjabi","91","25","5480","01-Apr-2022","Punjab","LUDHIANA","C/O GANGA ACRO WOOLS PVT LTD","KOT SHEIKHON","KOT SHEIKHON","141416",null,"8284834317"]
[27,14789954,"03091005401","ANJALI DUBEY","SUNIL KUMAR","JYOTI","16-Mar-2016",null,null,"Female","2nd","A",null,null,"General","No","No Disability","HINDU","Punjabi","105","15","5501","03-Aug-2022","Punjab","LUDHIANA","KOT SHEIKHON  CO-GANGA ACRO WOOLS PRIVATE LIMITED","KOT SHEIKHON","KOT SHEIKHON","141416","14","9653607175"]
[28,13487424,"03091005401","ASHNOOR KAUR","RAJWINDER SINGH","SUNITA RANI","04-Nov-2017","735888748383",null,"Female","2nd","A",null,null,"OBC","No","No Disability","SIKH","Punjabi","60","12","5488","01-Apr-2022","Punjab","LUDHIANA","RUPALON","RUPALON","RUPALON","141421",null,"8146590501","ORBC0101725","Oriental Bank of Commerce","'17252122001917",1,"Self","ASHNOOR KAUR"]
[29,15481541,"03091005401","AYUSH","SRIRAM","REKHA DEVI","08-Nov-2015","907931648705",null,"Male","2nd","A",null,null,"General","No","No Disability","HINDU","Punjabi","105","25","5519","10-May-2023","Punjab","LUDHIANA","rupalon","rupalon","rupalon","141421",null,"8437307135"]
[30,14951111,"03091005401","DAMNI","SUNEEL KUMAR","RAMGUNI","01-Mar-2017",null,null,"Female","2nd","A",null,null,"General","No","No Disability","HINDU","Punjabi","120","22","00","01-Nov-2022","Punjab","LUDHIANA","VILLAGE RULALON","RUPALON","RUPALON","141421",null,"8284834317"]
[31,14265008,"03091005401","GURNOOR SINGH","NARINDER SINGH","AMANDEEP KAUR","14-Nov-2017","236659535417",null,"Male","2nd","A",null,null,"SC","No","No Disability","SIKH","Punjabi","80","15","5499","15-Apr-2022","Punjab","LUDHIANA","RAPALON","RAPALON","RAPALON","141421",null,"9914710648"]
[32,14177842,"03091005401","JATINDER SAH","JOGINDER SAH","GEETA RANI","24-Sep-2016",null,null,"Male","2nd","A",null,null,"General","No","No Disability","HINDU","Punjabi","60","20","5478","01-Apr-2022","Punjab","LUDHIANA","C/O GANGA ACRO WOOLS PVT LTD","KOT SHEIKHON","KOT SHEIKHON","141416",null,"6201738557"]
[33,14951112,"03091005401","KAMNI","SUNEEL KUMAR","RAMGUNI","01-Mar-2017",null,null,"Female","2nd","A",null,null,"General","No","No Disability","HINDU","Punjabi","120","22","001","01-Nov-2022","Punjab","LUDHIANA","VILLAGE RULALON","RUPALON","RUPALON","141421",null,"8284834317"]
[34,14447499,"03091005401","KANCHAN YADAV","HANSRAJ YADAV","PRINKA YADAV","04-Apr-2016",null,null,"Female","2nd","A",null,null,"General","No","No Disability","HINDU","Punjabi","90","20","5500","06-May-2022","Punjab","LUDHIANA","C/O GANGA ACRO WOOLS PVT LTD","RAPALON","RAPALON","141416",null,"8284834317"]
[35,14850694,"03091005401","SAJAN KUMAR","MANOJ MANDAL","DIVYA DEVI","03-Aug-2017","951160467258",null,"Male","2nd","A",null,null,"General","No","No Disability","HINDU","Punjabi","93","16","5505","02-Sep-2022","Punjab","LUDHIANA","Ganga acro wools","Kot Sekhon","Kot Sekhon","141416",null,"6239318231"]
[36,14850735,"03091005401","SAVAN KUMAR","MANOJ MANDAL","DIVYA DEVI","18-Nov-2015","492473529204",null,"Male","2nd","A",null,null,"General","No","No Disability","HINDU","Punjabi","109","19","5506","02-Sep-2022","Punjab","LUDHIANA","Ganga acro wools","Kot Sekhon","Kot Sekhon","141416",null,"6239318231"]
[37,15528275,"03091005401","SHISHUPAL RAJ","BABLU PRASAD","NELAM  DEVI","28-Nov-2015","575544511919",null,"Male","2nd","A",null,null,"General","No","No Disability","HINDU","Punjabi","96","25","5524","20-May-2023","Punjab","LUDHIANA","rupalon","rupalon","rupalon","141421",null,"6239158395"]
[38,14178213,"03091005401","SHIVAM KUMAR","PRADEEP KUMAR SAH","RAMITA DEVI","18-Dec-2017",null,null,"Male","2nd","A",null,null,"General","No","No Disability","HINDU","Punjabi","91","25","5483","01-Apr-2022","Punjab","LUDHIANA","C/O GANGA ACRO WOOLS PVT LTD","KOT SHEIKHON","KOT SHEIKHON","141416",null,"8284834317"]
[39,14178160,"03091005401","SUMIT KUMAR","PRADEEP KUMAR SAH","RAMITA DEVI","13-Apr-2016",null,null,"Male","2nd","A",null,null,"General","No","No Disability","HINDU","Punjabi","91","26","5482","01-Apr-2022","Punjab","LUDHIANA","C/O GANGA ACRO WOOLS PVT LTD","KOT SHEIKHON","KOT SHEIKHON","141416",null,"8284834317"]
[40,13910485,"03091005401","AMNINDERJOT SINGH","NARINDER SINGH","AMANDEEP KAUR","01-Apr-2016","909519964382",null,"Male","3rd","A",null,null,"SC","No","No Disability","SIKH","Punjabi","90","18","5498","14-Apr-2022","Punjab","LUDHIANA","RUPALON","RUPALON","RUPALON","141412",null,"9478759388"]
[41,14179348,"03091005401","AMRITA","SHIV SAGAR","RADIKA","12-May-2015","423083765887",null,"Female","3rd","A",null,null,"General","No","No Disability","HINDU","Punjabi","130","20","5490","01-Apr-2022","Punjab","LUDHIANA","C/O GANGA ACRO WOOLS PVT LTD","KOT SHEIKHON","KOT SHEIKHON","141416",null,"9056863699"]
[42,13902201,"03091005401","ANSHIKA","LOKINDER","SUNITA","15-Jan-2016",null,null,"Female","3rd","A",null,null,"General","No","No Disability","HINDU","Punjabi","66","25","5468","16-Aug-2021","Punjab","LUDHIANA","Rupalon","Rupalon","Rupalon","141421","03","9872490501"]
[43,15481515,"03091005401","ARYAN","SRIRAM","REKHA DEVI","04-Feb-2014","738120364498",null,"Male","3rd","A",null,null,"General","No","No Disability","HINDU","Punjabi","118","30","5518","10-May-2023","Punjab","LUDHIANA","rupalon","rupalon","rupalon","141421",null,"8437307135"]
[44,13469463,"03091005401","JASPREET SINGH","RAJDEEP SINGH","RANI","11-Jun-2016","421407455057","421407455057","Male","3rd","A",null,null,"General","No","No Disability","HINDU","Punjabi","66","15","5460","17-Apr-2021","Punjab","LUDHIANA","Rupalon","Rupalon","Rupalon","141421","4","8146650353"]
[45,14178531,"03091005401","MANDEEP KUSHWAHA","RAMESH KUMAR KHUSHWAHA","REENA KHUSHWAHA","23-Dec-2015",null,null,"Male","3rd","A",null,null,"General","No","No Disability","HINDU","Punjabi","91","28","5486","01-Apr-2022","Punjab","LUDHIANA","C/O GANGA ACRO WOOLS PVT LTD","KOT SHEIKHON","KOT SHEIKHON","141416",null,"9876756503"]
[46,12297790,"03091005401","PALAK KUMARI","RAJU KUMAR","MALA DEVI","08-Oct-2015","289299542834",null,"Female","3rd","A",null,null,"OBC","No","No Disability","HINDU","Punjabi","121","20","5474","01-Apr-2022","Punjab","LUDHIANA","C/O GANGA ACRO WOOLS PVT LTD","KOT SEKHON","KOT SEKHON","141416",null,"8847218030"]
[47,14177744,"03091005401","SHIVANI KUMARI","JOGINDER SAH","GEETA DEVI","04-Aug-2014",null,null,"Female","3rd","A",null,null,"General","No","No Disability","HINDU","Punjabi","105","24","5477","01-Apr-2022","Punjab","LUDHIANA","C/O GANGA ACRO WOOLS PVT LTD","KOT SHEIKHON","KOT SHEIKHON","141416",null,"6201738557"]
[48,14176503,"03091005401","SIDDHARTH DUBEY","PARDEEP KUMAR","SONY DUBEY","30-Jul-2013","307289350718",null,"Male","3rd","A",null,null,"General","No","No Disability","HINDU","Punjabi","121","25","5472","01-Apr-2022","Punjab","LUDHIANA","C/O GANGA ACRO WOOLS PVT LTD","KOT SHEIKHON","KOT SHEIKHON","141416",null,"9621432507"]
[49,12752370,"03091005401","VARUN KUMAR TIWARI","DHARMPAL","POOJA SHARMA","06-Jun-2015",null,null,"Male","3rd","A",null,null,"General","No","No Disability","HINDU","Punjabi","87","19","5465","15-Apr-2020","Punjab","LUDHIANA","RUPALON","RUPALON","RUPALON","141421","2","8727863392"]
[50,11398497,"03091005401","AKASHDEEP SINGH","HARJINDER SINGH","BALJINDER KAUR","10-Dec-2014","570507466827",null,"Male","4th","A",null,null,"OBC","No","No Disability","SIKH","English","99","19","1054","01-Apr-2020","Punjab","LUDHIANA","CHAWA","CHAWA","GP","141412","07","9915932293"]
[51,15481745,"03091005401","AMARJIT KUMAR YADAV","KUSHAL YADAV","PRAMILA DEVI","29-Nov-2012","626239086222",null,"Male","4th","A",null,null,"General","No","No Disability","HINDU","Punjabi","135","42","5521","10-May-2023","Punjab","LUDHIANA","rupalon","rupalon","rupalon","141421",null,"9572891450"]
[52,13902238,"03091005401","ANSH","LOKINDER","SUNITA","11-Jan-2015",null,null,"Male","4th","A",null,null,"General","No","No Disability","HINDU","Punjabi","70","25","5469","16-Aug-2021","Punjab","LUDHIANA","Rupalon","Rupalon","Rupalon","141421","08","9872490501"]
[53,14177543,"03091005401","AYAT KHATOON","NASIM KHAN","RUKSANA KHATOON","24-Feb-2014","913142993886",null,"Female","4th","A",null,null,"General","No","No Disability","MUSLIM","Punjabi","121","32","5475","01-Apr-2022","Punjab","LUDHIANA","C/O GANGA ACRO WOOLS PVT LTD","KOT SHEKHON","KOT SHEKHON","141416",null,"8284834317"]
[54,14447505,"03091005401","DEVRAJ YADAV","HANSRAJ YADAV","PRINKA YADAV","25-Oct-2013",null,null,"Male","4th","A",null,null,"General","No","No Disability","HINDU","Punjabi","100","25","5501","06-May-2022","Punjab","LUDHIANA","C/O GANGA ACRO WOOLS PVT LTD","RAPALON","RAPALON","141416",null,"8284834317"]
[55,15501766,"03091005401","GYANTI KUMARI","MUNNA MAHTO","RINA DEVI","03-Oct-2013",null,null,"Male","4th","A",null,null,"General","No","No Disability","HINDU","Punjabi","105","35","5522","15-May-2023","Punjab","LUDHIANA","rupalon","rupalon","rupalon","141421",null,"9895391516"]
[56,14178453,"03091005401","KAJAL DEVI","RAMSEVAK","BITANA DEVI","01-Jan-2014",null,null,"Female","4th","A",null,null,"General","No","No Disability","HINDU","Punjabi","100","25","5485","01-Apr-2022","Punjab","LUDHIANA","C/O GANGA ACRO WOOLS PVT LTD","KOT SHEIKHON","KOT SHEIKHON","141416",null,"9634082335"]
[57,10601893,"03091005401","LOVEJOT SINGH","KHUSHLOVEPREET SINGH","SANDEEP KAUR","20-Sep-2014","954890013876",null,"Male","4th","A",null,null,"SC","No","No Disability","SIKH","Punjabi","109","25","5450","17-Nov-2017","Punjab","LUDHIANA","RUPALON","RUPALON","RUPALON","141421",null,"9872490501"]
[58,11563951,"03091005401","MANDEEP KAUR","DAVINDER SINGH","AMRIT KAUR","27-May-2015","220480323938",null,"Female","4th","A",null,null,"OBC","No","No Disability","SIKH","Punjabi","92","14","5461","19-Jul-2018","Punjab","LUDHIANA","RUPALON","RPALON","RUPALON","141421",null,"9465579672"]
[59,13832796,"03091005401","MANDEEP SINGH MANN","MANJIT SINGH MAAN","GURPREET KAUR","16-Sep-2013","767317390197",null,"Male","4th","A",null,null,"SC","No","No Disability","SIKH","Punjabi","122","24","5487","01-Apr-2022","Punjab","LUDHIANA","RUPALON","RUPALON","RUPALON","141421","0","9653333249"]
[60,12857771,"03091005401","RAMNEET KAUR","IQBAL SINGH","NAVDEEP KAUR","01-Aug-2015","289269594046",null,"Female","4th","A",null,null,"SC","No","No Disability","SIKH","Punjabi","90","10","5454","30-Apr-2020","Punjab","LUDHIANA","RUPALON","RUPALON","RUPALON","141421","4","8146590501","PSIB0021049","Punjab & Sind Bank","'10491000031698",1,"Self","RAMNEET KAUR"]
[61,10923657,"03091005401","SAHIBDEEP SINGH","BHARPOOR SINGH","SUNITA","20-Dec-2014","398445311798",null,"Male","4th","A",null,null,"SC","No","No Disability","SIKH","Punjabi","112","15","5456","30-Apr-2020","Punjab","LUDHIANA","RUPALON","RUPALON","RUPALON","141421",null,"8198016931"]
[62,14789855,"03091005401","ADARSH","SUNIL KUMAR","JYOTI","16-Oct-2013",null,null,"Male","5th","A",null,null,"General","No","No Disability","HINDU","Punjabi","130","28","5500","03-Aug-2022","Punjab","LUDHIANA","KOT SHEIKHON","KOT SHEIKHON","KOT SHEIKHON","141416","7","9653607175"]
[63,15704419,"03091005401","ANSHIKA","ATUL ASHOK YADAV","ANITA YADAV","01-Feb-2012","489884105293",null,"Male","5th","A",null,null,"General","No","No Disability","HINDU","Punjabi","130","35","5324","27-Jul-2023","Punjab","LUDHIANA","VILL RUPALON","RUPALON","RUPALON","141417",null,"8600399233"]
[64,10601127,"03091005401","ARASHDEEP SINGH","SHAMI KAPOOR","RAMANDEEP KAUR","06-Aug-2013","416322249683",null,"Male","5th","A",null,null,"SC","No","No Disability","SIKH","Punjabi","109","14","5441","14-Nov-2017","Punjab","LUDHIANA","RUPALON","RUPALON","RUPALON","141421","1","8146590501","ORBC0101725","Oriental Bank of Commerce","'17252122002300",1,"Self","ARASHDEEP SINGH"]
[65,10601676,"03091005401","BARINDERJIT SINGH","AVTAR SINGH","RAJWANT KAUR","24-May-2014","955341436801",null,"Male","5th","A",null,null,"OBC","No","No Disability","SIKH","Punjabi","111","15","5438","15-Nov-2017","Punjab","LUDHIANA","RUPLAON","RUPALON","RUPALON","141421",null,"8146590501","ORBC0101725","Oriental Bank of Commerce","'17252122002286",1,"Self","BARINDERJIT SINGH"]
[66,10601618,"03091005401","GURPREET SINGH","ANGREJ SINGH","LOVEPREET KAUR","12-Apr-2013","507530541707",null,"Male","5th","A",null,null,"OBC","No","No Disability","SIKH","Punjabi","109","13","5442","14-Nov-2017","Punjab","LUDHIANA","RUPALON","RUPALON","RUPALON","141421",null,"8146590501","ORBC0101725","Oriental Bank of Commerce","'17252122002293",1,"Self","GURPREET SINGH"]
[67,10601843,"03091005401","KAMALPREET KAUR","IQBAL SINGH","NAVDEEP KAUR","25-Nov-2013","521653740764",null,"Female","5th","A",null,null,"SC","No","No Disability","SIKH","Punjabi","112","14","5455","30-Apr-2020","Punjab","LUDHIANA","RUPALON","RUPALON","RUPALON","141421",null,"9872490501","PSIB0021049","Punjab & Sind Bank","'10491000027271",3,"Mother","NAVDEEP KAUR"]
[68,15527615,"03091005401","LAKKI BHARTI","BABLU PRASAD","NELAM RANI","28-Sep-2012","371749656999",null,"Female","5th","A",null,null,"General","No","No Disability","HINDU","Punjabi","128","34","5523","20-May-2023","Punjab","LUDHIANA","rupalon","rupalon","rupalon","141421",null,"6239158395"]
[69,10574184,"03091005401","RANVEER","PAPPU","SANTOS RANI","09-Nov-2012","999628441584",null,"Male","5th","A",null,null,"General","No","No Disability","SIKH","Punjabi","150","10","5466","01-Apr-2017","Punjab","LUDHIANA","VILL RUPALON","VILL RUPALON","RUPALON","141121","21","7528910974"]
[70,10601930,"03091005401","RITIKA","RAJINDER SINGH","KIRAN RANI","13-Apr-2014","467294164545",null,"Female","5th","A",null,null,"SC","No","No Disability","HINDU","Punjabi","110","13","5440","21-Nov-2017","Punjab","LUDHIANA","RUPALON","RUPALON","RUPALON","141421",null,"9872490501","PSIB0021049","Punjab & Sind Bank","'10491000029739",1,"Self","RITIKA"]
[71,11844689,"03091005401","VISHAL","BIJENDER KUMAR","SONIA","03-Apr-2013","253966515503",null,"Male","5th","A",null,null,"General","No","No Disability","SIKH","Punjabi","96","13","5443","06-Feb-2019","Punjab","LUDHIANA","RUPALON","RUPALON","RUPALON","141421",null,"7464821832"]

{"sheet":"Entry Sheet","index":2,"n_rows":43,"n_cols":20,"rows_kept":43,"cut":false,"hidden":false,"merged":[[40,0,40,3],[41,0,41,2],[14,13,15,13],[14,14,15,14],[14,15,15,15],[16,0,17,0],[16,1,17,1],[16,5,17,5],[16,6,17,6],[16,7,17,7],[16,8,17,8],[16,14,17,14],[16,15,17,15],[14,0,15,0],[14,1,15,1],[14,5,15,5],[14,6,15,6],[14,7,15,7],[18,0,19,0],[22,13,23,13],[22,14,23,14],[22,15,23,15],[24,0,25,0],[24,1,25,1],[0,0,0,14],[1,0,1,14],[2,0,2,15],[3,0,3,1],[3,2,3,4],[3,11,3,12],[4,10,4,11],[4,12,4,15],[39,0,39,15],[16,9,17,9],[16,10,17,10],[16,11,17,11],[16,12,17,12],[16,13,17,13],[14,8,15,8],[14,9,15,9],[14,10,15,10],[14,11,15,11],[14,12,15,12],[12,12,13,12],[12,13,13,13],[12,14,13,14],[12,15,13,15],[10,9,11,9],[12,0,13,0],[12,1,13,1],[12,5,13,5],[12,6,13,6],[12,7,13,7],[12,8,13,8],[12,9,13,9],[12,10,13,10],[12,11,13,11],[8,14,9,14],[8,15,9,15],[6,7,7,7],[10,0,11,0],[10,1,11,1],[10,5,11,5],[10,6,11,6],[10,7,11,7],[10,10,11,10],[10,11,11,11],[10,12,11,12],[10,13,11,13],[6,8,7,8],[10,8,11,8],[10,14,11,14],[10,15,11,15],[8,5,9,5],[8,6,9,6],[8,7,9,7],[8,8,9,8],[8,9,9,9],[8,10,9,10],[8,11,9,11],[8,12,9,12],[8,13,9,13],[18,1,19,1],[18,5,19,5],[18,6,19,6],[18,7,19,7],[6,14,7,14],[4,0,4,1],[41,11,41,15],[41,5,41,7],[41,8,41,10],[41,3,41,4],[40,8,40,12],[40,4,40,7],[6,9,7,9],[6,10,7,10],[6,11,7,11],[6,12,7,12],[6,13,7,13],[6,0,7,0],[6,1,7,1],[6,5,7,5],[6,6,7,6],[6,15,7,15],[8,0,9,0],[8,1,9,1],[22,6,23,6],[22,7,23,7],[18,13,19,13],[18,14,19,14],[18,15,19,15],[20,0,21,0],[20,1,21,1],[20,5,21,5],[20,6,21,6],[20,7,21,7],[20,8,21,8],[20,9,21,9],[20,10,21,10],[20,11,21,11],[20,12,21,12],[20,13,21,13],[20,14,21,14],[20,15,21,15],[18,8,19,8],[18,9,19,9],[18,10,19,10],[18,11,19,11],[18,12,19,12],[24,14,25,14],[24,15,25,15],[22,8,23,8],[22,9,23,9],[22,10,23,10],[22,11,23,11],[22,12,23,12],[22,0,23,0],[22,1,23,1],[22,5,23,5],[24,5,25,5],[24,6,25,6],[24,7,25,7],[24,8,25,8],[24,9,25,9],[24,10,25,10],[24,11,25,11],[24,12,25,12],[24,13,25,13],[26,8,27,8],[26,9,27,9],[26,10,27,10],[26,11,27,11],[26,12,27,12],[26,0,27,0],[26,1,27,1],[26,5,27,5],[26,6,27,6],[26,7,27,7],[28,7,29,7],[28,8,29,8],[28,9,29,9],[28,10,29,10],[28,11,29,11],[28,12,29,12],[28,13,29,13],[28,14,29,14],[28,15,29,15],[32,6,33,6],[32,7,33,7],[2,17,3,17],[1,18,3,18],[30,0,31,0],[30,1,31,1],[30,5,31,5],[30,6,31,6],[30,7,31,7],[30,8,31,8],[30,9,31,9],[30,10,31,10],[30,11,31,11],[30,12,31,12],[30,13,31,13],[30,14,31,14],[30,15,31,15],[26,13,27,13],[26,14,27,14],[26,15,27,15],[28,0,29,0],[28,1,29,1],[28,5,29,5],[28,6,29,6],[32,13,33,13],[32,14,33,14],[32,15,33,15],[34,0,35,0],[34,1,35,1],[34,5,35,5],[34,6,35,6],[34,7,35,7],[34,8,35,8],[34,9,35,9],[34,10,35,10],[34,11,35,11],[34,12,35,12],[34,13,35,13],[34,14,35,14],[34,15,35,15],[32,8,33,8],[32,9,33,9],[32,10,33,10],[32,11,33,11],[32,12,33,12],[32,0,33,0],[32,1,33,1],[32,5,33,5],[36,13,37,13],[36,14,37,14],[36,15,37,15],[36,8,37,8],[36,9,37,9],[36,10,37,10],[36,11,37,11],[36,12,37,12],[36,0,37,0],[36,1,37,1],[36,5,37,5],[36,6,37,6],[36,7,37,7]]}
["skUl is`iKAw  ivBwg,  pMjwb"]
["67vIAW  pMjwb  rwj  jon p`Dr  skUl KyfW  (luiDAwxw)  2023-24",null,null,null,null,null,null,null,null,null,null,null,null,null,null,null,null,null,10,"oooooou"]
["skUl dw  nwm:-srkwrI hweI skUl KMnw"]
["Kyf  dw  nwm:-",null,"ਰੱਸਾਕਸ਼ੀ",null,null,null,null,null,null,null,"imqI:- ",null,null,"qoN",null,"q`k"]
["aumr  vrg:- ",null,14,"ਲੜਕੇ",null,null,null,null,null,null,"Kyf  sQwn:"]
["lVI nM","sUtfYt AweIfI","iKfwrI  dw  nwm","ipqw  dw  nwm","mwqw  dw  nwm","ADwr  kwrf","SRyxI","jnm  imqI","dwKlw  nM","skUl  iv`c dwKl  hox dI  imqI","SRyxI  iv`c dwKl  hox dI  imqI","eIvYNt/ Bwr","ipCly  swl ikhVI Kyf/gru`p iv`c  Bwg\nilAw  hY","iKfwrI  dy Gr  dw p`kw  pqw","iKfwrI  dy dsqKq","qsdIk  Sudw  Poto"]
[1,null,null,null,null,{"$f":"IFERROR(VLOOKUP($B7,StudentData!$B$1:$AK$1014,7,0),\"\")","v":""},{"$f":"IFERROR(VLOOKUP($B7,StudentData!$B$1:$AK$1014,10,0),\"\")","v":""},{"$f":"IFERROR(VLOOKUP($B7,StudentData!$B$1:$AK$1014,6,0),\"\")","v":""},{"$f":"IFERROR(VLOOKUP($B7,StudentData!$B$1:$AK$1014,21,0),\"\")","v":""},{"$f":"IFERROR(VLOOKUP($B7,StudentData!$B$1:$AK$1014,22,0),\"\")","v":""},{"$f":"IFERROR(VLOOKUP($B7,StudentData!$B$1:$AK$1014,22,0),\"\")","v":""},null,null,{"$f":"IFERROR(VLOOKUP($B7,StudentData!$B$1:$AK$1014,25,0),\"\")","v":""}]
[null,null,{"$f":"IFERROR(VLOOKUP($B7,StudentData!$B$1:$AK$1014,3,0),\"\")","v":""},{"$f":"IFERROR(VLOOKUP($B7,StudentData!$B$1:$AK$1014,4,0),\"\")","v":""},{"$f":"IFERROR(VLOOKUP($B7,StudentData!$B$1:$AK$1014,5,0),\"\")","v":""}]
[2,null,null,null,null,{"$f":"IFERROR(VLOOKUP($B9,StudentData!$B$1:$AK$1014,7,0),\"\")","v":""},{"$f":"IFERROR(VLOOKUP($B9,StudentData!$B$1:$AK$1014,10,0),\"\")","v":""},{"$f":"IFERROR(VLOOKUP($B9,StudentData!$B$1:$AK$1014,6,0),\"\")","v":""},{"$f":"IFERROR(VLOOKUP($B9,StudentData!$B$1:$AK$1014,21,0),\"\")","v":""},{"$f":"IFERROR(VLOOKUP($B9,StudentData!$B$1:$AK$1014,22,0),\"\")","v":""},{"$f":"IFERROR(VLOOKUP($B9,StudentData!$B$1:$AK$1014,22,0),\"\")","v":""},null,null,{"$f":"IFERROR(VLOOKUP($B9,StudentData!$B$1:$AK$1014,25,0),\"\")","v":""}]
[null,null,{"$f":"IFERROR(VLOOKUP($B9,StudentData!$B$1:$AK$1014,3,0),\"\")","v":""},{"$f":"IFERROR(VLOOKUP($B9,StudentData!$B$1:$AK$1014,4,0),\"\")","v":""},{"$f":"IFERROR(VLOOKUP($B9,StudentData!$B$1:$AK$1014,5,0),\"\")","v":""}]
[3,null,null,null,null,{"$f":"IFERROR(VLOOKUP($B11,StudentData!$B$1:$AK$1014,7,0),\"\")","v":""},{"$f":"IFERROR(VLOOKUP($B11,StudentData!$B$1:$AK$1014,10,0),\"\")","v":""},{"$f":"IFERROR(VLOOKUP($B11,StudentData!$B$1:$AK$1014,6,0),\"\")","v":""},{"$f":"IFERROR(VLOOKUP($B11,StudentData!$B$1:$AK$1014,21,0),\"\")","v":""},{"$f":"IFERROR(VLOOKUP($B11,StudentData!$B$1:$AK$1014,22,0),\"\")","v":""},{"$f":"IFERROR(VLOOKUP($B11,StudentData!$B$1:$AK$1014,22,0),\"\")","v":""},null,null,{"$f":"IFERROR(VLOOKUP($B11,StudentData!$B$1:$AK$1014,25,0),\"\")","v":""}]
[null,null,{"$f":"IFERROR(VLOOKUP($B11,StudentData!$B$1:$AK$1014,3,0),\"\")","v":""},{"$f":"IFERROR(VLOOKUP($B11,StudentData!$B$1:$AK$1014,4,0),\"\")","v":""},{"$f":"IFERROR(VLOOKUP($B11,StudentData!$B$1:$AK$1014,5,0),\"\")","v":""}]
[4,null,null,null,null,{"$f":"IFERROR(VLOOKUP($B13,StudentData!$B$1:$AK$1014,7,0),\"\")","v":""},{"$f":"IFERROR(VLOOKUP($B13,StudentData!$B$1:$AK$1014,10,0),\"\")","v":""},{"$f":"IFERROR(VLOOKUP($B13,StudentData!$B$1:$AK$1014,6,0),\"\")","v":""},{"$f":"IFERROR(VLOOKUP($B13,StudentData!$B$1:$AK$1014,21,0),\"\")","v":""},{"$f":"IFERROR(VLOOKUP($B13,StudentData!$B$1:$AK$1014,22,0),\"\")","v":""},{"$f":"IFERROR(VLOOKUP($B13,StudentData!$B$1:$AK$1014,22,0),\"\")","v":""},null,null,{"$f":"IFERROR(VLOOKUP($B13,StudentData!$B$1:$AK$1014,25,0),\"\")","v":""}]
[null,null,{"$f":"IFERROR(VLOOKUP($B13,StudentData!$B$1:$AK$1014,3,0),\"\")","v":""},{"$f":"IFERROR(VLOOKUP($B13,StudentData!$B$1:$AK$1014,4,0),\"\")","v":""},{"$f":"IFERROR(VLOOKUP($B13,StudentData!$B$1:$AK$1014,5,0),\"\")","v":""}]
[5,null,null,null,null,{"$f":"IFERROR(VLOOKUP($B15,StudentData!$B$1:$AK$1014,7,0),\"\")","v":""},{"$f":"IFERROR(VLOOKUP($B15,StudentData!$B$1:$AK$1014,10,0),\"\")","v":""},{"$f":"IFERROR(VLOOKUP($B15,StudentData!$B$1:$AK$1014,6,0),\"\")","v":""},{"$f":"IFERROR(VLOOKUP($B15,StudentData!$B$1:$AK$1014,21,0),\"\")","v":""},{"$f":"IFERROR(VLOOKUP($B15,StudentData!$B$1:$AK$1014,22,0),\"\")","v":""},{"$f":"IFERROR(VLOOKUP($B15,StudentData!$B$1:$AK$1014,22,0),\"\")","v":""},null,null,{"$f":"IFERROR(VLOOKUP($B15,StudentData!$B$1:$AK$1014,25,0),\"\")","v":""}]
[null,null,{"$f":"IFERROR(VLOOKUP($B15,StudentData!$B$1:$AK$1014,3,0),\"\")","v":""},{"$f":"IFERROR(VLOOKUP($B15,StudentData!$B$1:$AK$1014,4,0),\"\")","v":""},{"$f":"IFERROR(VLOOKUP($B15,StudentData!$B$1:$AK$1014,5,0),\"\")","v":""}]
[6,null,null,null,null,{"$f":"IFERROR(VLOOKUP($B17,StudentData!$B$1:$AK$1014,7,0),\"\")","v":""},{"$f":"IFERROR(VLOOKUP($B17,StudentData!$B$1:$AK$1014,10,0),\"\")","v":""},{"$f":"IFERROR(VLOOKUP($B17,StudentData!$B$1:$AK$1014,6,0),\"\")","v":""},{"$f":"IFERROR(VLOOKUP($B17,StudentData!$B$1:$AK$1014,21,0),\"\")","v":""},{"$f":"IFERROR(VLOOKUP($B17,StudentData!$B$1:$AK$1014,22,0),\"\")","v":""},{"$f":"IFERROR(VLOOKUP($B17,StudentData!$B$1:$AK$1014,22,0),\"\")","v":""},null,null,{"$f":"IFERROR(VLOOKUP($B17,StudentData!$B$1:$AK$1014,25,0),\"\")","v":""}]
[null,null,{"$f":"IFERROR(VLOOKUP($B17,StudentData!$B$1:$AK$1014,3,0),\"\")","v":""},{"$f":"IFERROR(VLOOKUP($B17,StudentData!$B$1:$AK$1014,4,0),\"\")","v":""},{"$f":"IFERROR(VLOOKUP($B17,StudentData!$B$1:$AK$1014,5,0),\"\")","v":""}]
[7,null,null,null,null,{"$f":"IFERROR(VLOOKUP($B19,StudentData!$B$1:$AK$1014,7,0),\"\")","v":""},{"$f":"IFERROR(VLOOKUP($B19,StudentData!$B$1:$AK$1014,10,0),\"\")","v":""},{"$f":"IFERROR(VLOOKUP($B19,StudentData!$B$1:$AK$1014,6,0),\"\")","v":""},{"$f":"IFERROR(VLOOKUP($B19,StudentData!$B$1:$AK$1014,21,0),\"\")","v":""},{"$f":"IFERROR(VLOOKUP($B19,StudentData!$B$1:$AK$1014,22,0),\"\")","v":""},{"$f":"IFERROR(VLOOKUP($B19,StudentData!$B$1:$AK$1014,22,0),\"\")","v":""},null,null,{"$f":"IFERROR(VLOOKUP($B19,StudentData!$B$1:$AK$1014,25,0),\"\")","v":""}]
[null,null,{"$f":"IFERROR(VLOOKUP($B19,StudentData!$B$1:$AK$1014,3,0),\"\")","v":""},{"$f":"IFERROR(VLOOKUP($B19,StudentData!$B$1:$AK$1014,4,0),\"\")","v":""},{"$f":"IFERROR(VLOOKUP($B19,StudentData!$B$1:$AK$1014,5,0),\"\")","v":""}]
[8,null,null,null,null,{"$f":"IFERROR(VLOOKUP($B21,StudentData!$B$1:$AK$1014,7,0),\"\")","v":""},{"$f":"IFERROR(VLOOKUP($B21,StudentData!$B$1:$AK$1014,10,0),\"\")","v":""},{"$f":"IFERROR(VLOOKUP($B21,StudentData!$B$1:$AK$1014,6,0),\"\")","v":""},{"$f":"IFERROR(VLOOKUP($B21,StudentData!$B$1:$AK$1014,21,0),\"\")","v":""},{"$f":"IFERROR(VLOOKUP($B21,StudentData!$B$1:$AK$1014,22,0),\"\")","v":""},{"$f":"IFERROR(VLOOKUP($B21,StudentData!$B$1:$AK$1014,22,0),\"\")","v":""},null,null,{"$f":"IFERROR(VLOOKUP($B21,StudentData!$B$1:$AK$1014,25,0),\"\")","v":""}]
[null,null,{"$f":"IFERROR(VLOOKUP($B21,StudentData!$B$1:$AK$1014,3,0),\"\")","v":""},{"$f":"IFERROR(VLOOKUP($B21,StudentData!$B$1:$AK$1014,4,0),\"\")","v":""},{"$f":"IFERROR(VLOOKUP($B21,StudentData!$B$1:$AK$1014,5,0),\"\")","v":""}]
[9,null,null,null,null,{"$f":"IFERROR(VLOOKUP($B23,StudentData!$B$1:$AK$1014,7,0),\"\")","v":""},{"$f":"IFERROR(VLOOKUP($B23,StudentData!$B$1:$AK$1014,10,0),\"\")","v":""},{"$f":"IFERROR(VLOOKUP($B23,StudentData!$B$1:$AK$1014,6,0),\"\")","v":""},{"$f":"IFERROR(VLOOKUP($B23,StudentData!$B$1:$AK$1014,21,0),\"\")","v":""},{"$f":"IFERROR(VLOOKUP($B23,StudentData!$B$1:$AK$1014,22,0),\"\")","v":""},{"$f":"IFERROR(VLOOKUP($B23,StudentData!$B$1:$AK$1014,22,0),\"\")","v":""},null,null,{"$f":"IFERROR(VLOOKUP($B23,StudentData!$B$1:$AK$1014,25,0),\"\")","v":""}]
[null,null,{"$f":"IFERROR(VLOOKUP($B23,StudentData!$B$1:$AK$1014,3,0),\"\")","v":""},{"$f":"IFERROR(VLOOKUP($B23,StudentData!$B$1:$AK$1014,4,0),\"\")","v":""},{"$f":"IFERROR(VLOOKUP($B23,StudentData!$B$1:$AK$1014,5,0),\"\")","v":""}]
[10,null,null,null,null,{"$f":"IFERROR(VLOOKUP($B25,StudentData!$B$1:$AK$1014,7,0),\"\")","v":""},{"$f":"IFERROR(VLOOKUP($B25,StudentData!$B$1:$AK$1014,10,0),\"\")","v":""},{"$f":"IFERROR(VLOOKUP($B25,StudentData!$B$1:$AK$1014,6,0),\"\")","v":""},{"$f":"IFERROR(VLOOKUP($B25,StudentData!$B$1:$AK$1014,21,0),\"\")","v":""},{"$f":"IFERROR(VLOOKUP($B25,StudentData!$B$1:$AK$1014,22,0),\"\")","v":""},{"$f":"IFERROR(VLOOKUP($B25,StudentData!$B$1:$AK$1014,22,0),\"\")","v":""},null,null,{"$f":"IFERROR(VLOOKUP($B25,StudentData!$B$1:$AK$1014,25,0),\"\")","v":""}]
[null,null,{"$f":"IFERROR(VLOOKUP($B25,StudentData!$B$1:$AK$1014,3,0),\"\")","v":""},{"$f":"IFERROR(VLOOKUP($B25,StudentData!$B$1:$AK$1014,4,0),\"\")","v":""},{"$f":"IFERROR(VLOOKUP($B25,StudentData!$B$1:$AK$1014,5,0),\"\")","v":""}]
[11,null,null,null,null,{"$f":"IFERROR(VLOOKUP($B27,StudentData!$B$1:$AK$1014,7,0),\"\")","v":""},{"$f":"IFERROR(VLOOKUP($B27,StudentData!$B$1:$AK$1014,10,0),\"\")","v":""},{"$f":"IFERROR(VLOOKUP($B27,StudentData!$B$1:$AK$1014,6,0),\"\")","v":""},{"$f":"IFERROR(VLOOKUP($B27,StudentData!$B$1:$AK$1014,21,0),\"\")","v":""},{"$f":"IFERROR(VLOOKUP($B27,StudentData!$B$1:$AK$1014,22,0),\"\")","v":""},{"$f":"IFERROR(VLOOKUP($B27,StudentData!$B$1:$AK$1014,22,0),\"\")","v":""},null,null,{"$f":"IFERROR(VLOOKUP($B27,StudentData!$B$1:$AK$1014,25,0),\"\")","v":""}]
[null,null,{"$f":"IFERROR(VLOOKUP($B27,StudentData!$B$1:$AK$1014,3,0),\"\")","v":""},{"$f":"IFERROR(VLOOKUP($B27,StudentData!$B$1:$AK$1014,4,0),\"\")","v":""},{"$f":"IFERROR(VLOOKUP($B27,StudentData!$B$1:$AK$1014,5,0),\"\")","v":""}]
[12,null,null,null,null,{"$f":"IFERROR(VLOOKUP($B29,StudentData!$B$1:$AK$1014,7,0),\"\")","v":""},{"$f":"IFERROR(VLOOKUP($B29,StudentData!$B$1:$AK$1014,10,0),\"\")","v":""},{"$f":"IFERROR(VLOOKUP($B29,StudentData!$B$1:$AK$1014,6,0),\"\")","v":""},{"$f":"IFERROR(VLOOKUP($B29,StudentData!$B$1:$AK$1014,21,0),\"\")","v":""},{"$f":"IFERROR(VLOOKUP($B29,StudentData!$B$1:$AK$1014,22,0),\"\")","v":""},{"$f":"IFERROR(VLOOKUP($B29,StudentData!$B$1:$AK$1014,22,0),\"\")","v":""},null,null,{"$f":"IFERROR(VLOOKUP($B29,StudentData!$B$1:$AK$1014,25,0),\"\")","v":""}]
[null,null,{"$f":"IFERROR(VLOOKUP($B29,StudentData!$B$1:$AK$1014,3,0),\"\")","v":""},{"$f":"IFERROR(VLOOKUP($B29,StudentData!$B$1:$AK$1014,4,0),\"\")","v":""},{"$f":"IFERROR(VLOOKUP($B29,StudentData!$B$1:$AK$1014,5,0),\"\")","v":""}]
[13,null,null,null,null,{"$f":"IFERROR(VLOOKUP($B31,StudentData!$B$1:$AK$1014,7,0),\"\")","v":""},{"$f":"IFERROR(VLOOKUP($B31,StudentData!$B$1:$AK$1014,10,0),\"\")","v":""},{"$f":"IFERROR(VLOOKUP($B31,StudentData!$B$1:$AK$1014,6,0),\"\")","v":""},{"$f":"IFERROR(VLOOKUP($B31,StudentData!$B$1:$AK$1014,21,0),\"\")","v":""},{"$f":"IFERROR(VLOOKUP($B31,StudentData!$B$1:$AK$1014,22,0),\"\")","v":""},{"$f":"IFERROR(VLOOKUP($B31,StudentData!$B$1:$AK$1014,22,0),\"\")","v":""},null,null,{"$f":"IFERROR(VLOOKUP($B31,StudentData!$B$1:$AK$1014,25,0),\"\")","v":""}]
[null,null,{"$f":"IFERROR(VLOOKUP($B31,StudentData!$B$1:$AK$1014,3,0),\"\")","v":""},{"$f":"IFERROR(VLOOKUP($B31,StudentData!$B$1:$AK$1014,4,0),\"\")","v":""},{"$f":"IFERROR(VLOOKUP($B31,StudentData!$B$1:$AK$1014,5,0),\"\")","v":""}]
[14,null,null,null,null,{"$f":"IFERROR(VLOOKUP($B33,StudentData!$B$1:$AK$1014,7,0),\"\")","v":""},{"$f":"IFERROR(VLOOKUP($B33,StudentData!$B$1:$AK$1014,10,0),\"\")","v":""},{"$f":"IFERROR(VLOOKUP($B33,StudentData!$B$1:$AK$1014,6,0),\"\")","v":""},{"$f":"IFERROR(VLOOKUP($B33,StudentData!$B$1:$AK$1014,21,0),\"\")","v":""},{"$f":"IFERROR(VLOOKUP($B33,StudentData!$B$1:$AK$1014,22,0),\"\")","v":""},{"$f":"IFERROR(VLOOKUP($B33,StudentData!$B$1:$AK$1014,22,0),\"\")","v":""},null,null,{"$f":"IFERROR(VLOOKUP($B33,StudentData!$B$1:$AK$1014,25,0),\"\")","v":""}]
[null,null,{"$f":"IFERROR(VLOOKUP($B33,StudentData!$B$1:$AK$1014,3,0),\"\")","v":""},{"$f":"IFERROR(VLOOKUP($B33,StudentData!$B$1:$AK$1014,4,0),\"\")","v":""},{"$f":"IFERROR(VLOOKUP($B33,StudentData!$B$1:$AK$1014,5,0),\"\")","v":""}]
[15,null,null,null,null,{"$f":"IFERROR(VLOOKUP($B35,StudentData!$B$1:$AK$1014,7,0),\"\")","v":""},{"$f":"IFERROR(VLOOKUP($B35,StudentData!$B$1:$AK$1014,10,0),\"\")","v":""},{"$f":"IFERROR(VLOOKUP($B35,StudentData!$B$1:$AK$1014,6,0),\"\")","v":""},{"$f":"IFERROR(VLOOKUP($B35,StudentData!$B$1:$AK$1014,21,0),\"\")","v":""},{"$f":"IFERROR(VLOOKUP($B35,StudentData!$B$1:$AK$1014,22,0),\"\")","v":""},{"$f":"IFERROR(VLOOKUP($B35,StudentData!$B$1:$AK$1014,22,0),\"\")","v":""},null,null,{"$f":"IFERROR(VLOOKUP($B35,StudentData!$B$1:$AK$1014,25,0),\"\")","v":""}]
[null,null,{"$f":"IFERROR(VLOOKUP($B35,StudentData!$B$1:$AK$1014,3,0),\"\")","v":""},{"$f":"IFERROR(VLOOKUP($B35,StudentData!$B$1:$AK$1014,4,0),\"\")","v":""},{"$f":"IFERROR(VLOOKUP($B35,StudentData!$B$1:$AK$1014,5,0),\"\")","v":""}]
[16,null,null,null,null,{"$f":"IFERROR(VLOOKUP($B37,StudentData!$B$1:$AK$1014,7,0),\"\")","v":""},{"$f":"IFERROR(VLOOKUP($B37,StudentData!$B$1:$AK$1014,10,0),\"\")","v":""},{"$f":"IFERROR(VLOOKUP($B37,StudentData!$B$1:$AK$1014,6,0),\"\")","v":""},{"$f":"IFERROR(VLOOKUP($B37,StudentData!$B$1:$AK$1014,21,0),\"\")","v":""},{"$f":"IFERROR(VLOOKUP($B37,StudentData!$B$1:$AK$1014,22,0),\"\")","v":""},{"$f":"IFERROR(VLOOKUP($B37,StudentData!$B$1:$AK$1014,22,0),\"\")","v":""},null,null,{"$f":"IFERROR(VLOOKUP($B37,StudentData!$B$1:$AK$1014,25,0),\"\")","v":""}]
[null,null,{"$f":"IFERROR(VLOOKUP($B37,StudentData!$B$1:$AK$1014,3,0),\"\")","v":""},{"$f":"IFERROR(VLOOKUP($B37,StudentData!$B$1:$AK$1014,4,0),\"\")","v":""},{"$f":"IFERROR(VLOOKUP($B37,StudentData!$B$1:$AK$1014,5,0),\"\")","v":""}]
[null,null,null,null,null,null,null,null,null,null,null,{"$f":"IF(C4=\"ਰੱਸਾਕਸ਼ੀ\", SUM(L7:L38), \"\")","v":0}]
["qsdIk kIqw jWdw hY ik auprokq drj swry vyrvy skUl irkwrf Anuswr shI Aqy drusq hn[iKfwrI skUl KyfW iv`c Bwg lYx dIAW swrIAW SrqW pUrIAW krdy hn["]
["ijlHw tUrnwmYNt PIs dI rsId dw nM Aqy imqI:- ",null,null,null,null,null,null,null,"sports PMf dI rsId dw nM Aqy imqI:-"]
["tIm ieMcwrj dw nwm Aqy hsqwKr:- ",null,null,null,null,"tIm mYnyjr dw nwm Aqy hsqwKr:-",null,null,null,null,null,"ieMcwrj/ mu`K AiDAwpk/ ipRMsIpl dy hsqwKr Aqy mohr"]
[null,"www.teachershelp.in"]

{"sheet":"Entry Sheet 2","index":3,"n_rows":43,"n_cols":20,"rows_kept":43,"cut":false,"hidden":false,"merged":[[39,0,39,15],[40,0,40,3],[40,4,40,7],[40,8,40,12],[41,0,41,2],[41,3,41,4],[41,5,41,7],[41,8,41,10],[41,11,41,15],[34,12,35,12],[34,13,35,13],[34,14,35,14],[34,15,35,15],[36,0,37,0],[36,1,37,1],[36,5,37,5],[36,6,37,6],[36,7,37,7],[36,8,37,8],[36,15,37,15],[36,9,37,9],[36,10,37,10],[36,11,37,11],[36,12,37,12],[36,13,37,13],[36,14,37,14],[34,0,35,0],[34,1,35,1],[34,5,35,5],[34,6,35,6],[34,7,35,7],[34,8,35,8],[34,9,35,9],[34,10,35,10],[34,11,35,11],[30,12,31,12],[30,13,31,13],[30,14,31,14],[30,15,31,15],[32,0,33,0],[32,1,33,1],[32,5,33,5],[32,6,33,6],[32,7,33,7],[32,8,33,8],[32,15,33,15],[32,9,33,9],[32,10,33,10],[32,11,33,11],[32,12,33,12],[32,13,33,13],[32,14,33,14],[30,0,31,0],[30,1,31,1],[30,5,31,5],[30,6,31,6],[30,7,31,7],[30,8,31,8],[30,9,31,9],[30,10,31,10],[30,11,31,11],[26,12,27,12],[26,13,27,13],[26,14,27,14],[26,15,27,15],[28,0,29,0],[28,1,29,1],[28,5,29,5],[28,6,29,6],[28,7,29,7],[28,8,29,8],[28,15,29,15],[28,9,29,9],[28,10,29,10],[28,11,29,11],[28,12,29,12],[28,13,29,13],[28,14,29,14],[26,0,27,0],[26,1,27,1],[26,5,27,5],[26,6,27,6],[26,7,27,7],[26,8,27,8],[26,9,27,9],[26,10,27,10],[26,11,27,11],[22,12,23,12],[22,13,23,13],[22,14,23,14],[22,15,23,15],[24,0,25,0],[24,1,25,1],[24,5,25,5],[24,6,25,6],[24,7,25,7],[24,8,25,8],[24,15,25,15],[24,9,25,9],[24,10,25,10],[24,11,25,11],[24,12,25,12],[24,13,25,13],[24,14,25,14],[22,0,23,0],[22,1,23,1],[22,5,23,5],[22,6,23,6],[22,7,23,7],[22,8,23,8],[22,9,23,9],[22,10,23,10],[22,11,23,11],[18,12,19,12],[18,13,19,13],[18,14,19,14],[18,15,19,15],[20,0,21,0],[20,1,21,1],[20,5,21,5],[20,6,21,6],[20,7,21,7],[20,8,21,8],[20,15,21,15],[20,9,21,9],[20,10,21,10],[20,11,21,11],[20,12,21,12],[20,13,21,13],[20,14,21,14],[18,0,19,0],[18,1,19,1],[18,5,19,5],[18,6,19,6],[18,7,19,7],[18,8,19,8],[18,9,19,9],[18,10,19,10],[18,11,19,11],[14,12,15,12],[14,13,15,13],[14,14,15,14],[14,15,15,15],[16,0,17,0],[16,1,17,1],[16,5,17,5],[16,6,17,6],[16,7,17,7],[16,8,17,8],[16,15,17,15],[16,9,17,9],[16,10,17,10],[16,11,17,11],[16,12,17,12],[16,13,17,13],[16,14,17,14],[14,0,15,0],[14,1,15,1],[14,5,15,5],[14,6,15,6],[14,7,15,7],[14,8,15,8],[14,9,15,9],[14,10,15,10],[14,11,15,11],[10,14,11,14],[10,15,11,15],[12,0,13,0],[12,1,13,1],[12,5,13,5],[12,6,13,6],[12,7,13,7],[12,8,13,8],[12,15,13,15],[12,9,13,9],[12,10,13,10],[12,11,13,11],[12,12,13,12],[12,13,13,13],[12,14,13,14],[8,15,9,15],[10,0,11,0],[10,1,11,1],[10,5,11,5],[10,6,11,6],[10,7,11,7],[10,8,11,8],[10,9,11,9],[10,10,11,10],[10,11,11,11],[8,9,9,9],[8,10,9,10],[8,11,9,11],[8,12,9,12],[8,13,9,13],[8,14,9,14],[8,0,9,0],[8,1,9,1],[8,5,9,5],[8,6,9,6],[8,7,9,7],[8,8,9,8],[10,12,11,12],[10,13,11,13],[0,0,0,15],[1,0,1,15],[1,18,3,18],[2,0,2,15],[2,17,3,17],[3,0,3,1],[3,2,3,4],[3,11,3,12],[6,10,7,10],[6,11,7,11],[6,12,7,12],[6,13,7,13],[6,14,7,14],[6,15,7,15],[4,0,4,1],[4,10,4,11],[4,12,4,15],[6,0,7,0],[6,1,7,1],[6,5,7,5],[6,6,7,6],[6,7,7,7],[6,8,7,8],[6,9,7,9]]}
["skUl is`iKAw  ivBwg,  pMjwb"]
["67vIAW  pMjwb  rwj  jon p`Dr  skUl KyfW  (luiDAwxw)  2023-24",null,null,null,null,null,null,null,null,null,null,null,null,null,null,null,null,null,6,"oooooou"]
["skUl dw  nwm:-srkwrI hweI skUl KMnw"]
["Kyf  dw  nwm:-",null,"ਰੱਸਾਕਸ਼ੀ",null,null,null,null,null,null,null,"imqI:- ",null,null,"qoN",null,"q`k"]
["aumr  vrg:- ",null,14,"ਲੜਕੇ",null,null,null,null,null,null,"Kyf  sQwn:"]
["lVI nM","sUtfYt AweIfI","iKfwrI  dw  nwm","ipqw  dw  nwm","mwqw  dw  nwm","ADwr  kwrf","SRyxI","jnm  imqI","dwKlw  nM","skUl  iv`c dwKl  hox dI  imqI","SRyxI  iv`c dwKl  hox dI  imqI","eIvYNt/ Bwr","ipCly  swl ikhVI Kyf/gru`p iv`c  Bwg\nilAw  hY","iKfwrI  dy Gr  dw p`kw  pqw","iKfwrI  dy dsqKq","qsdIk  Sudw  Poto"]
[1,null,null,null,null,{"$f":"IFERROR(VLOOKUP($B7,StudentData!$B$1:$AK$1014,7,0),\"\")","v":""},{"$f":"IFERROR(VLOOKUP($B7,StudentData!$B$1:$AK$1014,10,0),\"\")","v":""},{"$f":"IFERROR(VLOOKUP($B7,StudentData!$B$1:$AK$1014,6,0),\"\")","v":""},{"$f":"IFERROR(VLOOKUP($B7,StudentData!$B$1:$AK$1014,21,0),\"\")","v":""},{"$f":"IFERROR(VLOOKUP($B7,StudentData!$B$1:$AK$1014,22,0),\"\")","v":""},{"$f":"IFERROR(VLOOKUP($B7,StudentData!$B$1:$AK$1014,22,0),\"\")","v":""},null,null,{"$f":"IFERROR(VLOOKUP($B7,StudentData!$B$1:$AK$1014,25,0),\"\")","v":""}]
[null,null,{"$f":"IFERROR(VLOOKUP($B7,StudentData!$B$1:$AK$1014,3,0),\"\")","v":""},{"$f":"IFERROR(VLOOKUP($B7,StudentData!$B$1:$AK$1014,4,0),\"\")","v":""},{"$f":"IFERROR(VLOOKUP($B7,StudentData!$B$1:$AK$1014,5,0),\"\")","v":""}]
[2,null,null,null,null,{"$f":"IFERROR(VLOOKUP($B9,StudentData!$B$1:$AK$1014,7,0),\"\")","v":""},{"$f":"IFERROR(VLOOKUP($B9,StudentData!$B$1:$AK$1014,10,0),\"\")","v":""},{"$f":"IFERROR(VLOOKUP($B9,StudentData!$B$1:$AK$1014,6,0),\"\")","v":""},{"$f":"IFERROR(VLOOKUP($B9,StudentData!$B$1:$AK$1014,21,0),\"\")","v":""},{"$f":"IFERROR(VLOOKUP($B9,StudentData!$B$1:$AK$1014,22,0),\"\")","v":""},{"$f":"IFERROR(VLOOKUP($B9,StudentData!$B$1:$AK$1014,22,0),\"\")","v":""},null,null,{"$f":"IFERROR(VLOOKUP($B9,StudentData!$B$1:$AK$1014,25,0),\"\")","v":""}]
[null,null,{"$f":"IFERROR(VLOOKUP($B9,StudentData!$B$1:$AK$1014,3,0),\"\")","v":""},{"$f":"IFERROR(VLOOKUP($B9,StudentData!$B$1:$AK$1014,4,0),\"\")","v":""},{"$f":"IFERROR(VLOOKUP($B9,StudentData!$B$1:$AK$1014,5,0),\"\")","v":""}]
[3,null,null,null,null,{"$f":"IFERROR(VLOOKUP($B11,StudentData!$B$1:$AK$1014,7,0),\"\")","v":""},{"$f":"IFERROR(VLOOKUP($B11,StudentData!$B$1:$AK$1014,10,0),\"\")","v":""},{"$f":"IFERROR(VLOOKUP($B11,StudentData!$B$1:$AK$1014,6,0),\"\")","v":""},{"$f":"IFERROR(VLOOKUP($B11,StudentData!$B$1:$AK$1014,21,0),\"\")","v":""},{"$f":"IFERROR(VLOOKUP($B11,StudentData!$B$1:$AK$1014,22,0),\"\")","v":""},{"$f":"IFERROR(VLOOKUP($B11,StudentData!$B$1:$AK$1014,22,0),\"\")","v":""},null,null,{"$f":"IFERROR(VLOOKUP($B11,StudentData!$B$1:$AK$1014,25,0),\"\")","v":""}]
[null,null,{"$f":"IFERROR(VLOOKUP($B11,StudentData!$B$1:$AK$1014,3,0),\"\")","v":""},{"$f":"IFERROR(VLOOKUP($B11,StudentData!$B$1:$AK$1014,4,0),\"\")","v":""},{"$f":"IFERROR(VLOOKUP($B11,StudentData!$B$1:$AK$1014,5,0),\"\")","v":""}]
[4,null,null,null,null,{"$f":"IFERROR(VLOOKUP($B13,StudentData!$B$1:$AK$1014,7,0),\"\")","v":""},{"$f":"IFERROR(VLOOKUP($B13,StudentData!$B$1:$AK$1014,10,0),\"\")","v":""},{"$f":"IFERROR(VLOOKUP($B13,StudentData!$B$1:$AK$1014,6,0),\"\")","v":""},{"$f":"IFERROR(VLOOKUP($B13,StudentData!$B$1:$AK$1014,21,0),\"\")","v":""},{"$f":"IFERROR(VLOOKUP($B13,StudentData!$B$1:$AK$1014,22,0),\"\")","v":""},{"$f":"IFERROR(VLOOKUP($B13,StudentData!$B$1:$AK$1014,22,0),\"\")","v":""},null,null,{"$f":"IFERROR(VLOOKUP($B13,StudentData!$B$1:$AK$1014,25,0),\"\")","v":""}]
[null,null,{"$f":"IFERROR(VLOOKUP($B13,StudentData!$B$1:$AK$1014,3,0),\"\")","v":""},{"$f":"IFERROR(VLOOKUP($B13,StudentData!$B$1:$AK$1014,4,0),\"\")","v":""},{"$f":"IFERROR(VLOOKUP($B13,StudentData!$B$1:$AK$1014,5,0),\"\")","v":""}]
[5,null,null,null,null,{"$f":"IFERROR(VLOOKUP($B15,StudentData!$B$1:$AK$1014,7,0),\"\")","v":""},{"$f":"IFERROR(VLOOKUP($B15,StudentData!$B$1:$AK$1014,10,0),\"\")","v":""},{"$f":"IFERROR(VLOOKUP($B15,StudentData!$B$1:$AK$1014,6,0),\"\")","v":""},{"$f":"IFERROR(VLOOKUP($B15,StudentData!$B$1:$AK$1014,21,0),\"\")","v":""},{"$f":"IFERROR(VLOOKUP($B15,StudentData!$B$1:$AK$1014,22,0),\"\")","v":""},{"$f":"IFERROR(VLOOKUP($B15,StudentData!$B$1:$AK$1014,22,0),\"\")","v":""},null,null,{"$f":"IFERROR(VLOOKUP($B15,StudentData!$B$1:$AK$1014,25,0),\"\")","v":""}]
[null,null,{"$f":"IFERROR(VLOOKUP($B15,StudentData!$B$1:$AK$1014,3,0),\"\")","v":""},{"$f":"IFERROR(VLOOKUP($B15,StudentData!$B$1:$AK$1014,4,0),\"\")","v":""},{"$f":"IFERROR(VLOOKUP($B15,StudentData!$B$1:$AK$1014,5,0),\"\")","v":""}]
[6,null,null,null,null,{"$f":"IFERROR(VLOOKUP($B17,StudentData!$B$1:$AK$1014,7,0),\"\")","v":""},{"$f":"IFERROR(VLOOKUP($B17,StudentData!$B$1:$AK$1014,10,0),\"\")","v":""},{"$f":"IFERROR(VLOOKUP($B17,StudentData!$B$1:$AK$1014,6,0),\"\")","v":""},{"$f":"IFERROR(VLOOKUP($B17,StudentData!$B$1:$AK$1014,21,0),\"\")","v":""},{"$f":"IFERROR(VLOOKUP($B17,StudentData!$B$1:$AK$1014,22,0),\"\")","v":""},{"$f":"IFERROR(VLOOKUP($B17,StudentData!$B$1:$AK$1014,22,0),\"\")","v":""},null,null,{"$f":"IFERROR(VLOOKUP($B17,StudentData!$B$1:$AK$1014,25,0),\"\")","v":""}]
[null,null,{"$f":"IFERROR(VLOOKUP($B17,StudentData!$B$1:$AK$1014,3,0),\"\")","v":""},{"$f":"IFERROR(VLOOKUP($B17,StudentData!$B$1:$AK$1014,4,0),\"\")","v":""},{"$f":"IFERROR(VLOOKUP($B17,StudentData!$B$1:$AK$1014,5,0),\"\")","v":""}]
[7,null,null,null,null,{"$f":"IFERROR(VLOOKUP($B19,StudentData!$B$1:$AK$1014,7,0),\"\")","v":""},{"$f":"IFERROR(VLOOKUP($B19,StudentData!$B$1:$AK$1014,10,0),\"\")","v":""},{"$f":"IFERROR(VLOOKUP($B19,StudentData!$B$1:$AK$1014,6,0),\"\")","v":""},{"$f":"IFERROR(VLOOKUP($B19,StudentData!$B$1:$AK$1014,21,0),\"\")","v":""},{"$f":"IFERROR(VLOOKUP($B19,StudentData!$B$1:$AK$1014,22,0),\"\")","v":""},{"$f":"IFERROR(VLOOKUP($B19,StudentData!$B$1:$AK$1014,22,0),\"\")","v":""},null,null,{"$f":"IFERROR(VLOOKUP($B19,StudentData!$B$1:$AK$1014,25,0),\"\")","v":""}]
[null,null,{"$f":"IFERROR(VLOOKUP($B19,StudentData!$B$1:$AK$1014,3,0),\"\")","v":""},{"$f":"IFERROR(VLOOKUP($B19,StudentData!$B$1:$AK$1014,4,0),\"\")","v":""},{"$f":"IFERROR(VLOOKUP($B19,StudentData!$B$1:$AK$1014,5,0),\"\")","v":""}]
[8,null,null,null,null,{"$f":"IFERROR(VLOOKUP($B21,StudentData!$B$1:$AK$1014,7,0),\"\")","v":""},{"$f":"IFERROR(VLOOKUP($B21,StudentData!$B$1:$AK$1014,10,0),\"\")","v":""},{"$f":"IFERROR(VLOOKUP($B21,StudentData!$B$1:$AK$1014,6,0),\"\")","v":""},{"$f":"IFERROR(VLOOKUP($B21,StudentData!$B$1:$AK$1014,21,0),\"\")","v":""},{"$f":"IFERROR(VLOOKUP($B21,StudentData!$B$1:$AK$1014,22,0),\"\")","v":""},{"$f":"IFERROR(VLOOKUP($B21,StudentData!$B$1:$AK$1014,22,0),\"\")","v":""},null,null,{"$f":"IFERROR(VLOOKUP($B21,StudentData!$B$1:$AK$1014,25,0),\"\")","v":""}]
[null,null,{"$f":"IFERROR(VLOOKUP($B21,StudentData!$B$1:$AK$1014,3,0),\"\")","v":""},{"$f":"IFERROR(VLOOKUP($B21,StudentData!$B$1:$AK$1014,4,0),\"\")","v":""},{"$f":"IFERROR(VLOOKUP($B21,StudentData!$B$1:$AK$1014,5,0),\"\")","v":""}]
[9,null,null,null,null,{"$f":"IFERROR(VLOOKUP($B23,StudentData!$B$1:$AK$1014,7,0),\"\")","v":""},{"$f":"IFERROR(VLOOKUP($B23,StudentData!$B$1:$AK$1014,10,0),\"\")","v":""},{"$f":"IFERROR(VLOOKUP($B23,StudentData!$B$1:$AK$1014,6,0),\"\")","v":""},{"$f":"IFERROR(VLOOKUP($B23,StudentData!$B$1:$AK$1014,21,0),\"\")","v":""},{"$f":"IFERROR(VLOOKUP($B23,StudentData!$B$1:$AK$1014,22,0),\"\")","v":""},{"$f":"IFERROR(VLOOKUP($B23,StudentData!$B$1:$AK$1014,22,0),\"\")","v":""},null,null,{"$f":"IFERROR(VLOOKUP($B23,StudentData!$B$1:$AK$1014,25,0),\"\")","v":""}]
[null,null,{"$f":"IFERROR(VLOOKUP($B23,StudentData!$B$1:$AK$1014,3,0),\"\")","v":""},{"$f":"IFERROR(VLOOKUP($B23,StudentData!$B$1:$AK$1014,4,0),\"\")","v":""},{"$f":"IFERROR(VLOOKUP($B23,StudentData!$B$1:$AK$1014,5,0),\"\")","v":""}]
[10,null,null,null,null,{"$f":"IFERROR(VLOOKUP($B25,StudentData!$B$1:$AK$1014,7,0),\"\")","v":""},{"$f":"IFERROR(VLOOKUP($B25,StudentData!$B$1:$AK$1014,10,0),\"\")","v":""},{"$f":"IFERROR(VLOOKUP($B25,StudentData!$B$1:$AK$1014,6,0),\"\")","v":""},{"$f":"IFERROR(VLOOKUP($B25,StudentData!$B$1:$AK$1014,21,0),\"\")","v":""},{"$f":"IFERROR(VLOOKUP($B25,StudentData!$B$1:$AK$1014,22,0),\"\")","v":""},{"$f":"IFERROR(VLOOKUP($B25,StudentData!$B$1:$AK$1014,22,0),\"\")","v":""},null,null,{"$f":"IFERROR(VLOOKUP($B25,StudentData!$B$1:$AK$1014,25,0),\"\")","v":""}]
[null,null,{"$f":"IFERROR(VLOOKUP($B25,StudentData!$B$1:$AK$1014,3,0),\"\")","v":""},{"$f":"IFERROR(VLOOKUP($B25,StudentData!$B$1:$AK$1014,4,0),\"\")","v":""},{"$f":"IFERROR(VLOOKUP($B25,StudentData!$B$1:$AK$1014,5,0),\"\")","v":""}]
[11,null,null,null,null,{"$f":"IFERROR(VLOOKUP($B27,StudentData!$B$1:$AK$1014,7,0),\"\")","v":""},{"$f":"IFERROR(VLOOKUP($B27,StudentData!$B$1:$AK$1014,10,0),\"\")","v":""},{"$f":"IFERROR(VLOOKUP($B27,StudentData!$B$1:$AK$1014,6,0),\"\")","v":""},{"$f":"IFERROR(VLOOKUP($B27,StudentData!$B$1:$AK$1014,21,0),\"\")","v":""},{"$f":"IFERROR(VLOOKUP($B27,StudentData!$B$1:$AK$1014,22,0),\"\")","v":""},{"$f":"IFERROR(VLOOKUP($B27,StudentData!$B$1:$AK$1014,22,0),\"\")","v":""},null,null,{"$f":"IFERROR(VLOOKUP($B27,StudentData!$B$1:$AK$1014,25,0),\"\")","v":""}]
[null,null,{"$f":"IFERROR(VLOOKUP($B27,StudentData!$B$1:$AK$1014,3,0),\"\")","v":""},{"$f":"IFERROR(VLOOKUP($B27,StudentData!$B$1:$AK$1014,4,0),\"\")","v":""},{"$f":"IFERROR(VLOOKUP($B27,StudentData!$B$1:$AK$1014,5,0),\"\")","v":""}]
[12,null,null,null,null,{"$f":"IFERROR(VLOOKUP($B29,StudentData!$B$1:$AK$1014,7,0),\"\")","v":""},{"$f":"IFERROR(VLOOKUP($B29,StudentData!$B$1:$AK$1014,10,0),\"\")","v":""},{"$f":"IFERROR(VLOOKUP($B29,StudentData!$B$1:$AK$1014,6,0),\"\")","v":""},{"$f":"IFERROR(VLOOKUP($B29,StudentData!$B$1:$AK$1014,21,0),\"\")","v":""},{"$f":"IFERROR(VLOOKUP($B29,StudentData!$B$1:$AK$1014,22,0),\"\")","v":""},{"$f":"IFERROR(VLOOKUP($B29,StudentData!$B$1:$AK$1014,22,0),\"\")","v":""},null,null,{"$f":"IFERROR(VLOOKUP($B29,StudentData!$B$1:$AK$1014,25,0),\"\")","v":""}]
[null,null,{"$f":"IFERROR(VLOOKUP($B29,StudentData!$B$1:$AK$1014,3,0),\"\")","v":""},{"$f":"IFERROR(VLOOKUP($B29,StudentData!$B$1:$AK$1014,4,0),\"\")","v":""},{"$f":"IFERROR(VLOOKUP($B29,StudentData!$B$1:$AK$1014,5,0),\"\")","v":""}]
[13,null,null,null,null,{"$f":"IFERROR(VLOOKUP($B31,StudentData!$B$1:$AK$1014,7,0),\"\")","v":""},{"$f":"IFERROR(VLOOKUP($B31,StudentData!$B$1:$AK$1014,10,0),\"\")","v":""},{"$f":"IFERROR(VLOOKUP($B31,StudentData!$B$1:$AK$1014,6,0),\"\")","v":""},{"$f":"IFERROR(VLOOKUP($B31,StudentData!$B$1:$AK$1014,21,0),\"\")","v":""},{"$f":"IFERROR(VLOOKUP($B31,StudentData!$B$1:$AK$1014,22,0),\"\")","v":""},{"$f":"IFERROR(VLOOKUP($B31,StudentData!$B$1:$AK$1014,22,0),\"\")","v":""},null,null,{"$f":"IFERROR(VLOOKUP($B31,StudentData!$B$1:$AK$1014,25,0),\"\")","v":""}]
[null,null,{"$f":"IFERROR(VLOOKUP($B31,StudentData!$B$1:$AK$1014,3,0),\"\")","v":""},{"$f":"IFERROR(VLOOKUP($B31,StudentData!$B$1:$AK$1014,4,0),\"\")","v":""},{"$f":"IFERROR(VLOOKUP($B31,StudentData!$B$1:$AK$1014,5,0),\"\")","v":""}]
[14,null,null,null,null,{"$f":"IFERROR(VLOOKUP($B33,StudentData!$B$1:$AK$1014,7,0),\"\")","v":""},{"$f":"IFERROR(VLOOKUP($B33,StudentData!$B$1:$AK$1014,10,0),\"\")","v":""},{"$f":"IFERROR(VLOOKUP($B33,StudentData!$B$1:$AK$1014,6,0),\"\")","v":""},{"$f":"IFERROR(VLOOKUP($B33,StudentData!$B$1:$AK$1014,21,0),\"\")","v":""},{"$f":"IFERROR(VLOOKUP($B33,StudentData!$B$1:$AK$1014,22,0),\"\")","v":""},{"$f":"IFERROR(VLOOKUP($B33,StudentData!$B$1:$AK$1014,22,0),\"\")","v":""},null,null,{"$f":"IFERROR(VLOOKUP($B33,StudentData!$B$1:$AK$1014,25,0),\"\")","v":""}]
[null,null,{"$f":"IFERROR(VLOOKUP($B33,StudentData!$B$1:$AK$1014,3,0),\"\")","v":""},{"$f":"IFERROR(VLOOKUP($B33,StudentData!$B$1:$AK$1014,4,0),\"\")","v":""},{"$f":"IFERROR(VLOOKUP($B33,StudentData!$B$1:$AK$1014,5,0),\"\")","v":""}]
[15,null,null,null,null,{"$f":"IFERROR(VLOOKUP($B35,StudentData!$B$1:$AK$1014,7,0),\"\")","v":""},{"$f":"IFERROR(VLOOKUP($B35,StudentData!$B$1:$AK$1014,10,0),\"\")","v":""},{"$f":"IFERROR(VLOOKUP($B35,StudentData!$B$1:$AK$1014,6,0),\"\")","v":""},{"$f":"IFERROR(VLOOKUP($B35,StudentData!$B$1:$AK$1014,21,0),\"\")","v":""},{"$f":"IFERROR(VLOOKUP($B35,StudentData!$B$1:$AK$1014,22,0),\"\")","v":""},{"$f":"IFERROR(VLOOKUP($B35,StudentData!$B$1:$AK$1014,22,0),\"\")","v":""},null,null,{"$f":"IFERROR(VLOOKUP($B35,StudentData!$B$1:$AK$1014,25,0),\"\")","v":""}]
[null,null,{"$f":"IFERROR(VLOOKUP($B35,StudentData!$B$1:$AK$1014,3,0),\"\")","v":""},{"$f":"IFERROR(VLOOKUP($B35,StudentData!$B$1:$AK$1014,4,0),\"\")","v":""},{"$f":"IFERROR(VLOOKUP($B35,StudentData!$B$1:$AK$1014,5,0),\"\")","v":""}]
[16,null,null,null,null,{"$f":"IFERROR(VLOOKUP($B37,StudentData!$B$1:$AK$1014,7,0),\"\")","v":""},{"$f":"IFERROR(VLOOKUP($B37,StudentData!$B$1:$AK$1014,10,0),\"\")","v":""},{"$f":"IFERROR(VLOOKUP($B37,StudentData!$B$1:$AK$1014,6,0),\"\")","v":""},{"$f":"IFERROR(VLOOKUP($B37,StudentData!$B$1:$AK$1014,21,0),\"\")","v":""},{"$f":"IFERROR(VLOOKUP($B37,StudentData!$B$1:$AK$1014,22,0),\"\")","v":""},{"$f":"IFERROR(VLOOKUP($B37,StudentData!$B$1:$AK$1014,22,0),\"\")","v":""},null,null,{"$f":"IFERROR(VLOOKUP($B37,StudentData!$B$1:$AK$1014,25,0),\"\")","v":""}]
[null,null,{"$f":"IFERROR(VLOOKUP($B37,StudentData!$B$1:$AK$1014,3,0),\"\")","v":""},{"$f":"IFERROR(VLOOKUP($B37,StudentData!$B$1:$AK$1014,4,0),\"\")","v":""},{"$f":"IFERROR(VLOOKUP($B37,StudentData!$B$1:$AK$1014,5,0),\"\")","v":""}]
[null,null,null,null,null,null,null,null,null,null,null,{"$f":"IF(C4=\"ਰੱਸਾਕਸ਼ੀ\", SUM(L7:L38), \"\")","v":0}]
["qsdIk kIqw jWdw hY ik auprokq drj swry vyrvy skUl irkwrf Anuswr shI Aqy drusq hn[iKfwrI skUl KyfW iv`c Bwg lYx dIAW swrIAW SrqW pUrIAW krdy hn["]
["ijlHw tUrnwmYNt PIs dI rsId dw nM Aqy imqI:- ",null,null,null,null,null,null,null,"sports PMf dI rsId dw nM Aqy imqI:-"]
["tIm ieMcwrj dw nwm Aqy hsqwKr:- ",null,null,null,null,"tIm mYnyjr dw nwm Aqy hsqwKr:-",null,null,null,null,null,"ieMcwrj/ mu`K AiDAwpk/ ipRMsIpl dy hsqwKr Aqy mohr"]
[null,"www.teachershelp.in"]

{"sheet":"EntrySheetLegalPage","index":4,"n_rows":42,"n_cols":19,"rows_kept":42,"cut":false,"hidden":false,"merged":[[40,14,40,15],[36,15,37,15],[39,0,39,15],[40,0,40,3],[40,4,40,7],[40,8,40,12],[41,0,41,2],[41,3,41,4],[41,5,41,7],[41,8,41,10],[41,11,41,15],[36,9,37,9],[36,10,37,10],[36,11,37,11],[36,12,37,12],[36,13,37,13],[36,14,37,14],[34,12,35,12],[34,13,35,13],[34,14,35,14],[34,15,35,15],[36,0,37,0],[36,1,37,1],[36,5,37,5],[36,6,37,6],[36,7,37,7],[36,8,37,8],[32,15,33,15],[34,0,35,0],[34,1,35,1],[34,5,35,5],[34,6,35,6],[34,7,35,7],[34,8,35,8],[34,9,35,9],[34,10,35,10],[34,11,35,11],[32,9,33,9],[32,10,33,10],[32,11,33,11],[32,12,33,12],[32,13,33,13],[32,14,33,14],[30,12,31,12],[30,13,31,13],[30,14,31,14],[30,15,31,15],[32,0,33,0],[32,1,33,1],[32,5,33,5],[32,6,33,6],[32,7,33,7],[32,8,33,8],[28,15,29,15],[30,0,31,0],[30,1,31,1],[30,5,31,5],[30,6,31,6],[30,7,31,7],[30,8,31,8],[30,9,31,9],[30,10,31,10],[30,11,31,11],[28,9,29,9],[28,10,29,10],[28,11,29,11],[28,12,29,12],[28,13,29,13],[28,14,29,14],[26,12,27,12],[26,13,27,13],[26,14,27,14],[26,15,27,15],[28,0,29,0],[28,1,29,1],[28,5,29,5],[28,6,29,6],[28,7,29,7],[28,8,29,8],[24,15,25,15],[26,0,27,0],[26,1,27,1],[26,5,27,5],[26,6,27,6],[26,7,27,7],[26,8,27,8],[26,9,27,9],[26,10,27,10],[26,11,27,11],[24,9,25,9],[24,10,25,10],[24,11,25,11],[24,12,25,12],[24,13,25,13],[24,14,25,14],[22,12,23,12],[22,13,23,13],[22,14,23,14],[22,15,23,15],[24,0,25,0],[24,1,25,1],[24,5,25,5],[24,6,25,6],[24,7,25,7],[24,8,25,8],[20,15,21,15],[22,0,23,0],[22,1,23,1],[22,5,23,5],[22,6,23,6],[22,7,23,7],[22,8,23,8],[22,9,23,9],[22,10,23,10],[22,11,23,11],[20,9,21,9],[20,10,21,10],[20,11,21,11],[20,12,21,12],[20,13,21,13],[20,14,21,14],[18,12,19,12],[18,13,19,13],[18,14,19,14],[18,15,19,15],[20,0,21,0],[20,1,21,1],[20,5,21,5],[20,6,21,6],[20,7,21,7],[20,8,21,8],[16,15,17,15],[18,0,19,0],[18,1,19,1],[18,5,19,5],[18,6,19,6],[18,7,19,7],[18,8,19,8],[18,9,19,9],[18,10,19,10],[18,11,19,11],[16,9,17,9],[16,10,17,10],[16,11,17,11],[16,12,17,12],[16,13,17,13],[16,14,17,14],[14,12,15,12],[14,13,15,13],[14,14,15,14],[14,15,15,15],[16,0,17,0],[16,1,17,1],[16,5,17,5],[16,6,17,6],[16,7,17,7],[16,8,17,8],[12,15,13,15],[14,0,15,0],[14,1,15,1],[14,5,15,5],[14,6,15,6],[14,7,15,7],[14,8,15,8],[14,9,15,9],[14,10,15,10],[14,11,15,11],[12,9,13,9],[12,10,13,10],[12,11,13,11],[12,12,13,12],[12,13,13,13],[12,14,13,14],[10,12,11,12],[10,13,11,13],[10,14,11,14],[10,15,11,15],[12,0,13,0],[12,1,13,1],[12,5,13,5],[12,6,13,6],[12,7,13,7],[12,8,13,8],[8,15,9,15],[10,0,11,0],[10,1,11,1],[10,5,11,5],[10,6,11,6],[10,7,11,7],[10,8,11,8],[10,9,11,9],[10,10,11,10],[10,11,11,11],[8,9,9,9],[8,10,9,10],[8,11,9,11],[8,12,9,12],[8,13,9,13],[8,14,9,14],[8,0,9,0],[8,1,9,1],[8,5,9,5],[8,6,9,6],[8,7,9,7],[8,8,9,8],[6,10,7,10],[6,11,7,11],[6,12,7,12],[6,13,7,13],[6,14,7,14],[6,15,7,15],[4,0,4,1],[4,10,4,11],[4,12,4,15],[6,0,7,0],[6,1,7,1],[6,5,7,5],[6,6,7,6],[6,7,7,7],[6,8,7,8],[6,9,7,9],[0,0,0,15],[1,0,1,15],[1,18,3,18],[2,0,2,15],[2,17,3,17],[3,0,3,1],[3,2,3,4],[3,11,3,12]]}
["skUl is`iKAw  ivBwg,  pMjwb"]
["67vIAW  pMjwb  rwj  jon p`Dr  skUl KyfW  (luiDAwxw)  2023-24",null,null,null,null,null,null,null,null,null,null,null,null,null,null,null,null,null,12]
["skUl dw  nwm:-srkwrI hweI skUl KMnw"]
["Kyf  dw  nwm:-",null,"ਰੱਸਾਕਸ਼ੀ",null,null,null,null,null,null,null,"imqI:- ",null,null,"qoN",null,"q`k"]
["aumr  vrg:- ",null,14,"ਲੜਕੇ",null,null,null,null,null,null,"Kyf  sQwn:"]
["lVI nM","sUtfYt AweIfI","iKfwrI  dw  nwm","ipqw  dw  nwm","mwqw  dw  nwm","ADwr  kwrf","SRyxI","jnm  imqI","dwKlw  nM","skUl  iv`c dwKl  hox dI  imqI","SRyxI  iv`c dwKl  hox dI  imqI","eIvYNt/ Bwr","ipCly  swl ikhVI Kyf/gru`p iv`c  Bwg\nilAw  hY","iKfwrI  dy Gr  dw p`kw  pqw","iKfwrI  dy dsqKq","qsdIk  Sudw  Poto"]
[1,15522539,null,null,null,{"$f":"IFERROR(VLOOKUP($B7,StudentData!$B$1:$AK$1014,7,0),\"\")","v":"933855699901"},{"$f":"IFERROR(VLOOKUP($B7,StudentData!$B$1:$AK$1014,10,0),\"\")","v":"LKG"},{"$f":"IFERROR(VLOOKUP($B7,StudentData!$B$1:$AK$1014,6,0),\"\")","v":"08-Aug-2019"},{"$f":"IFERROR(VLOOKUP($B7,StudentData!$B$1:$AK$1014,21,0),\"\")","v":"100"},{"$f":"IFERROR(VLOOKUP($B7,StudentData!$B$1:$AK$1014,22,0),\"\")","v":"12-May-2023"},{"$f":"IFERROR(VLOOKUP($B7,StudentData!$B$1:$AK$1014,22,0),\"\")","v":"12-May-2023"},null,null,{"$f":"IFERROR(VLOOKUP($B7,StudentData!$B$1:$AK$1014,25,0),\"\")","v":"rupalon"}]
[null,null,{"$f":"IFERROR(VLOOKUP($B7,StudentData!$B$1:$AK$1014,3,0),\"\")","v":"ABHI GAUTAM"},{"$f":"IFERROR(VLOOKUP($B7,StudentData!$B$1:$AK$1014,4,0),\"\")","v":"SONU GAUTAM"},{"$f":"IFERROR(VLOOKUP($B7,StudentData!$B$1:$AK$1014,5,0),\"\")","v":"MANORAMA DEVI"}]
[2,null,null,null,null,{"$f":"IFERROR(VLOOKUP($B9,StudentData!$B$1:$AK$1014,7,0),\"\")","v":""},{"$f":"IFERROR(VLOOKUP($B9,StudentData!$B$1:$AK$1014,10,0),\"\")","v":""},{"$f":"IFERROR(VLOOKUP($B9,StudentData!$B$1:$AK$1014,6,0),\"\")","v":""},{"$f":"IFERROR(VLOOKUP($B9,StudentData!$B$1:$AK$1014,21,0),\"\")","v":""},{"$f":"IFERROR(VLOOKUP($B9,StudentData!$B$1:$AK$1014,22,0),\"\")","v":""},{"$f":"IFERROR(VLOOKUP($B9,StudentData!$B$1:$AK$1014,22,0),\"\")","v":""},null,null,{"$f":"IFERROR(VLOOKUP($B9,StudentData!$B$1:$AK$1014,25,0),\"\")","v":""}]
[null,null,{"$f":"IFERROR(VLOOKUP($B9,StudentData!$B$1:$AK$1014,3,0),\"\")","v":""},{"$f":"IFERROR(VLOOKUP($B9,StudentData!$B$1:$AK$1014,4,0),\"\")","v":""},{"$f":"IFERROR(VLOOKUP($B9,StudentData!$B$1:$AK$1014,5,0),\"\")","v":""}]
[3,null,null,null,null,{"$f":"IFERROR(VLOOKUP($B11,StudentData!$B$1:$AK$1014,7,0),\"\")","v":""},{"$f":"IFERROR(VLOOKUP($B11,StudentData!$B$1:$AK$1014,10,0),\"\")","v":""},{"$f":"IFERROR(VLOOKUP($B11,StudentData!$B$1:$AK$1014,6,0),\"\")","v":""},{"$f":"IFERROR(VLOOKUP($B11,StudentData!$B$1:$AK$1014,21,0),\"\")","v":""},{"$f":"IFERROR(VLOOKUP($B11,StudentData!$B$1:$AK$1014,22,0),\"\")","v":""},{"$f":"IFERROR(VLOOKUP($B11,StudentData!$B$1:$AK$1014,22,0),\"\")","v":""},null,null,{"$f":"IFERROR(VLOOKUP($B11,StudentData!$B$1:$AK$1014,25,0),\"\")","v":""}]
[null,null,{"$f":"IFERROR(VLOOKUP($B11,StudentData!$B$1:$AK$1014,3,0),\"\")","v":""},{"$f":"IFERROR(VLOOKUP($B11,StudentData!$B$1:$AK$1014,4,0),\"\")","v":""},{"$f":"IFERROR(VLOOKUP($B11,StudentData!$B$1:$AK$1014,5,0),\"\")","v":""}]
[4,null,null,null,null,{"$f":"IFERROR(VLOOKUP($B13,StudentData!$B$1:$AK$1014,7,0),\"\")","v":""},{"$f":"IFERROR(VLOOKUP($B13,StudentData!$B$1:$AK$1014,10,0),\"\")","v":""},{"$f":"IFERROR(VLOOKUP($B13,StudentData!$B$1:$AK$1014,6,0),\"\")","v":""},{"$f":"IFERROR(VLOOKUP($B13,StudentData!$B$1:$AK$1014,21,0),\"\")","v":""},{"$f":"IFERROR(VLOOKUP($B13,StudentData!$B$1:$AK$1014,22,0),\"\")","v":""},{"$f":"IFERROR(VLOOKUP($B13,StudentData!$B$1:$AK$1014,22,0),\"\")","v":""},null,null,{"$f":"IFERROR(VLOOKUP($B13,StudentData!$B$1:$AK$1014,25,0),\"\")","v":""}]
[null,null,{"$f":"IFERROR(VLOOKUP($B13,StudentData!$B$1:$AK$1014,3,0),\"\")","v":""},{"$f":"IFERROR(VLOOKUP($B13,StudentData!$B$1:$AK$1014,4,0),\"\")","v":""},{"$f":"IFERROR(VLOOKUP($B13,StudentData!$B$1:$AK$1014,5,0),\"\")","v":""}]
[5,null,null,null,null,{"$f":"IFERROR(VLOOKUP($B15,StudentData!$B$1:$AK$1014,7,0),\"\")","v":""},{"$f":"IFERROR(VLOOKUP($B15,StudentData!$B$1:$AK$1014,10,0),\"\")","v":""},{"$f":"IFERROR(VLOOKUP($B15,StudentData!$B$1:$AK$1014,6,0),\"\")","v":""},{"$f":"IFERROR(VLOOKUP($B15,StudentData!$B$1:$AK$1014,21,0),\"\")","v":""},{"$f":"IFERROR(VLOOKUP($B15,StudentData!$B$1:$AK$1014,22,0),\"\")","v":""},{"$f":"IFERROR(VLOOKUP($B15,StudentData!$B$1:$AK$1014,22,0),\"\")","v":""},null,null,{"$f":"IFERROR(VLOOKUP($B15,StudentData!$B$1:$AK$1014,25,0),\"\")","v":""}]
[null,null,{"$f":"IFERROR(VLOOKUP($B15,StudentData!$B$1:$AK$1014,3,0),\"\")","v":""},{"$f":"IFERROR(VLOOKUP($B15,StudentData!$B$1:$AK$1014,4,0),\"\")","v":""},{"$f":"IFERROR(VLOOKUP($B15,StudentData!$B$1:$AK$1014,5,0),\"\")","v":""}]
[6,null,null,null,null,{"$f":"IFERROR(VLOOKUP($B17,StudentData!$B$1:$AK$1014,7,0),\"\")","v":""},{"$f":"IFERROR(VLOOKUP($B17,StudentData!$B$1:$AK$1014,10,0),\"\")","v":""},{"$f":"IFERROR(VLOOKUP($B17,StudentData!$B$1:$AK$1014,6,0),\"\")","v":""},{"$f":"IFERROR(VLOOKUP($B17,StudentData!$B$1:$AK$1014,21,0),\"\")","v":""},{"$f":"IFERROR(VLOOKUP($B17,StudentData!$B$1:$AK$1014,22,0),\"\")","v":""},{"$f":"IFERROR(VLOOKUP($B17,StudentData!$B$1:$AK$1014,22,0),\"\")","v":""},null,null,{"$f":"IFERROR(VLOOKUP($B17,StudentData!$B$1:$AK$1014,25,0),\"\")","v":""}]
[null,null,{"$f":"IFERROR(VLOOKUP($B17,StudentData!$B$1:$AK$1014,3,0),\"\")","v":""},{"$f":"IFERROR(VLOOKUP($B17,StudentData!$B$1:$AK$1014,4,0),\"\")","v":""},{"$f":"IFERROR(VLOOKUP($B17,StudentData!$B$1:$AK$1014,5,0),\"\")","v":""}]
[7,null,null,null,null,{"$f":"IFERROR(VLOOKUP($B19,StudentData!$B$1:$AK$1014,7,0),\"\")","v":""},{"$f":"IFERROR(VLOOKUP($B19,StudentData!$B$1:$AK$1014,10,0),\"\")","v":""},{"$f":"IFERROR(VLOOKUP($B19,StudentData!$B$1:$AK$1014,6,0),\"\")","v":""},{"$f":"IFERROR(VLOOKUP($B19,StudentData!$B$1:$AK$1014,21,0),\"\")","v":""},{"$f":"IFERROR(VLOOKUP($B19,StudentData!$B$1:$AK$1014,22,0),\"\")","v":""},{"$f":"IFERROR(VLOOKUP($B19,StudentData!$B$1:$AK$1014,22,0),\"\")","v":""},null,null,{"$f":"IFERROR(VLOOKUP($B19,StudentData!$B$1:$AK$1014,25,0),\"\")","v":""}]
[null,null,{"$f":"IFERROR(VLOOKUP($B19,StudentData!$B$1:$AK$1014,3,0),\"\")","v":""},{"$f":"IFERROR(VLOOKUP($B19,StudentData!$B$1:$AK$1014,4,0),\"\")","v":""},{"$f":"IFERROR(VLOOKUP($B19,StudentData!$B$1:$AK$1014,5,0),\"\")","v":""}]
[8,null,null,null,null,{"$f":"IFERROR(VLOOKUP($B21,StudentData!$B$1:$AK$1014,7,0),\"\")","v":""},{"$f":"IFERROR(VLOOKUP($B21,StudentData!$B$1:$AK$1014,10,0),\"\")","v":""},{"$f":"IFERROR(VLOOKUP($B21,StudentData!$B$1:$AK$1014,6,0),\"\")","v":""},{"$f":"IFERROR(VLOOKUP($B21,StudentData!$B$1:$AK$1014,21,0),\"\")","v":""},{"$f":"IFERROR(VLOOKUP($B21,StudentData!$B$1:$AK$1014,22,0),\"\")","v":""},{"$f":"IFERROR(VLOOKUP($B21,StudentData!$B$1:$AK$1014,22,0),\"\")","v":""},null,null,{"$f":"IFERROR(VLOOKUP($B21,StudentData!$B$1:$AK$1014,25,0),\"\")","v":""}]
[null,null,{"$f":"IFERROR(VLOOKUP($B21,StudentData!$B$1:$AK$1014,3,0),\"\")","v":""},{"$f":"IFERROR(VLOOKUP($B21,StudentData!$B$1:$AK$1014,4,0),\"\")","v":""},{"$f":"IFERROR(VLOOKUP($B21,StudentData!$B$1:$AK$1014,5,0),\"\")","v":""}]
[9,null,null,null,null,{"$f":"IFERROR(VLOOKUP($B23,StudentData!$B$1:$AK$1014,7,0),\"\")","v":""},{"$f":"IFERROR(VLOOKUP($B23,StudentData!$B$1:$AK$1014,10,0),\"\")","v":""},{"$f":"IFERROR(VLOOKUP($B23,StudentData!$B$1:$AK$1014,6,0),\"\")","v":""},{"$f":"IFERROR(VLOOKUP($B23,StudentData!$B$1:$AK$1014,21,0),\"\")","v":""},{"$f":"IFERROR(VLOOKUP($B23,StudentData!$B$1:$AK$1014,22,0),\"\")","v":""},{"$f":"IFERROR(VLOOKUP($B23,StudentData!$B$1:$AK$1014,22,0),\"\")","v":""},null,null,{"$f":"IFERROR(VLOOKUP($B23,StudentData!$B$1:$AK$1014,25,0),\"\")","v":""}]
[null,null,{"$f":"IFERROR(VLOOKUP($B23,StudentData!$B$1:$AK$1014,3,0),\"\")","v":""},{"$f":"IFERROR(VLOOKUP($B23,StudentData!$B$1:$AK$1014,4,0),\"\")","v":""},{"$f":"IFERROR(VLOOKUP($B23,StudentData!$B$1:$AK$1014,5,0),\"\")","v":""}]
[10,null,null,null,null,{"$f":"IFERROR(VLOOKUP($B25,StudentData!$B$1:$AK$1014,7,0),\"\")","v":""},{"$f":"IFERROR(VLOOKUP($B25,StudentData!$B$1:$AK$1014,10,0),\"\")","v":""},{"$f":"IFERROR(VLOOKUP($B25,StudentData!$B$1:$AK$1014,6,0),\"\")","v":""},{"$f":"IFERROR(VLOOKUP($B25,StudentData!$B$1:$AK$1014,21,0),\"\")","v":""},{"$f":"IFERROR(VLOOKUP($B25,StudentData!$B$1:$AK$1014,22,0),\"\")","v":""},{"$f":"IFERROR(VLOOKUP($B25,StudentData!$B$1:$AK$1014,22,0),\"\")","v":""},null,null,{"$f":"IFERROR(VLOOKUP($B25,StudentData!$B$1:$AK$1014,25,0),\"\")","v":""}]
[null,null,{"$f":"IFERROR(VLOOKUP($B25,StudentData!$B$1:$AK$1014,3,0),\"\")","v":""},{"$f":"IFERROR(VLOOKUP($B25,StudentData!$B$1:$AK$1014,4,0),\"\")","v":""},{"$f":"IFERROR(VLOOKUP($B25,StudentData!$B$1:$AK$1014,5,0),\"\")","v":""}]
[11,null,null,null,null,{"$f":"IFERROR(VLOOKUP($B27,StudentData!$B$1:$AK$1014,7,0),\"\")","v":""},{"$f":"IFERROR(VLOOKUP($B27,StudentData!$B$1:$AK$1014,10,0),\"\")","v":""},{"$f":"IFERROR(VLOOKUP($B27,StudentData!$B$1:$AK$1014,6,0),\"\")","v":""},{"$f":"IFERROR(VLOOKUP($B27,StudentData!$B$1:$AK$1014,21,0),\"\")","v":""},{"$f":"IFERROR(VLOOKUP($B27,StudentData!$B$1:$AK$1014,22,0),\"\")","v":""},{"$f":"IFERROR(VLOOKUP($B27,StudentData!$B$1:$AK$1014,22,0),\"\")","v":""},null,null,{"$f":"IFERROR(VLOOKUP($B27,StudentData!$B$1:$AK$1014,25,0),\"\")","v":""}]
[null,null,{"$f":"IFERROR(VLOOKUP($B27,StudentData!$B$1:$AK$1014,3,0),\"\")","v":""},{"$f":"IFERROR(VLOOKUP($B27,StudentData!$B$1:$AK$1014,4,0),\"\")","v":""},{"$f":"IFERROR(VLOOKUP($B27,StudentData!$B$1:$AK$1014,5,0),\"\")","v":""}]
[12,null,null,null,null,{"$f":"IFERROR(VLOOKUP($B29,StudentData!$B$1:$AK$1014,7,0),\"\")","v":""},{"$f":"IFERROR(VLOOKUP($B29,StudentData!$B$1:$AK$1014,10,0),\"\")","v":""},{"$f":"IFERROR(VLOOKUP($B29,StudentData!$B$1:$AK$1014,6,0),\"\")","v":""},{"$f":"IFERROR(VLOOKUP($B29,StudentData!$B$1:$AK$1014,21,0),\"\")","v":""},{"$f":"IFERROR(VLOOKUP($B29,StudentData!$B$1:$AK$1014,22,0),\"\")","v":""},{"$f":"IFERROR(VLOOKUP($B29,StudentData!$B$1:$AK$1014,22,0),\"\")","v":""},null,null,{"$f":"IFERROR(VLOOKUP($B29,StudentData!$B$1:$AK$1014,25,0),\"\")","v":""}]
[null,null,{"$f":"IFERROR(VLOOKUP($B29,StudentData!$B$1:$AK$1014,3,0),\"\")","v":""},{"$f":"IFERROR(VLOOKUP($B29,StudentData!$B$1:$AK$1014,4,0),\"\")","v":""},{"$f":"IFERROR(VLOOKUP($B29,StudentData!$B$1:$AK$1014,5,0),\"\")","v":""}]
[13,null,null,null,null,{"$f":"IFERROR(VLOOKUP($B31,StudentData!$B$1:$AK$1014,7,0),\"\")","v":""},{"$f":"IFERROR(VLOOKUP($B31,StudentData!$B$1:$AK$1014,10,0),\"\")","v":""},{"$f":"IFERROR(VLOOKUP($B31,StudentData!$B$1:$AK$1014,6,0),\"\")","v":""},{"$f":"IFERROR(VLOOKUP($B31,StudentData!$B$1:$AK$1014,21,0),\"\")","v":""},{"$f":"IFERROR(VLOOKUP($B31,StudentData!$B$1:$AK$1014,22,0),\"\")","v":""},{"$f":"IFERROR(VLOOKUP($B31,StudentData!$B$1:$AK$1014,22,0),\"\")","v":""},null,null,{"$f":"IFERROR(VLOOKUP($B31,StudentData!$B$1:$AK$1014,25,0),\"\")","v":""}]
[null,null,{"$f":"IFERROR(VLOOKUP($B31,StudentData!$B$1:$AK$1014,3,0),\"\")","v":""},{"$f":"IFERROR(VLOOKUP($B31,StudentData!$B$1:$AK$1014,4,0),\"\")","v":""},{"$f":"IFERROR(VLOOKUP($B31,StudentData!$B$1:$AK$1014,5,0),\"\")","v":""}]
[14,null,null,null,null,{"$f":"IFERROR(VLOOKUP($B33,StudentData!$B$1:$AK$1014,7,0),\"\")","v":""},{"$f":"IFERROR(VLOOKUP($B33,StudentData!$B$1:$AK$1014,10,0),\"\")","v":""},{"$f":"IFERROR(VLOOKUP($B33,StudentData!$B$1:$AK$1014,6,0),\"\")","v":""},{"$f":"IFERROR(VLOOKUP($B33,StudentData!$B$1:$AK$1014,21,0),\"\")","v":""},{"$f":"IFERROR(VLOOKUP($B33,StudentData!$B$1:$AK$1014,22,0),\"\")","v":""},{"$f":"IFERROR(VLOOKUP($B33,StudentData!$B$1:$AK$1014,22,0),\"\")","v":""},null,null,{"$f":"IFERROR(VLOOKUP($B33,StudentData!$B$1:$AK$1014,25,0),\"\")","v":""}]
[null,null,{"$f":"IFERROR(VLOOKUP($B33,StudentData!$B$1:$AK$1014,3,0),\"\")","v":""},{"$f":"IFERROR(VLOOKUP($B33,StudentData!$B$1:$AK$1014,4,0),\"\")","v":""},{"$f":"IFERROR(VLOOKUP($B33,StudentData!$B$1:$AK$1014,5,0),\"\")","v":""}]
[15,null,null,null,null,{"$f":"IFERROR(VLOOKUP($B35,StudentData!$B$1:$AK$1014,7,0),\"\")","v":""},{"$f":"IFERROR(VLOOKUP($B35,StudentData!$B$1:$AK$1014,10,0),\"\")","v":""},{"$f":"IFERROR(VLOOKUP($B35,StudentData!$B$1:$AK$1014,6,0),\"\")","v":""},{"$f":"IFERROR(VLOOKUP($B35,StudentData!$B$1:$AK$1014,21,0),\"\")","v":""},{"$f":"IFERROR(VLOOKUP($B35,StudentData!$B$1:$AK$1014,22,0),\"\")","v":""},{"$f":"IFERROR(VLOOKUP($B35,StudentData!$B$1:$AK$1014,22,0),\"\")","v":""},null,null,{"$f":"IFERROR(VLOOKUP($B35,StudentData!$B$1:$AK$1014,25,0),\"\")","v":""}]
[null,null,{"$f":"IFERROR(VLOOKUP($B35,StudentData!$B$1:$AK$1014,3,0),\"\")","v":""},{"$f":"IFERROR(VLOOKUP($B35,StudentData!$B$1:$AK$1014,4,0),\"\")","v":""},{"$f":"IFERROR(VLOOKUP($B35,StudentData!$B$1:$AK$1014,5,0),\"\")","v":""}]
[16,null,null,null,null,{"$f":"IFERROR(VLOOKUP($B37,StudentData!$B$1:$AK$1014,7,0),\"\")","v":""},{"$f":"IFERROR(VLOOKUP($B37,StudentData!$B$1:$AK$1014,10,0),\"\")","v":""},{"$f":"IFERROR(VLOOKUP($B37,StudentData!$B$1:$AK$1014,6,0),\"\")","v":""},{"$f":"IFERROR(VLOOKUP($B37,StudentData!$B$1:$AK$1014,21,0),\"\")","v":""},{"$f":"IFERROR(VLOOKUP($B37,StudentData!$B$1:$AK$1014,22,0),\"\")","v":""},{"$f":"IFERROR(VLOOKUP($B37,StudentData!$B$1:$AK$1014,22,0),\"\")","v":""},null,null,{"$f":"IFERROR(VLOOKUP($B37,StudentData!$B$1:$AK$1014,25,0),\"\")","v":""}]
[null,null,{"$f":"IFERROR(VLOOKUP($B37,StudentData!$B$1:$AK$1014,3,0),\"\")","v":""},{"$f":"IFERROR(VLOOKUP($B37,StudentData!$B$1:$AK$1014,4,0),\"\")","v":""},{"$f":"IFERROR(VLOOKUP($B37,StudentData!$B$1:$AK$1014,5,0),\"\")","v":""}]
[null,null,null,null,null,null,null,null,null,null,null,{"$f":"IF(C4=\"ਰੱਸਾਕਸ਼ੀ\", SUM(L7:L38), \"\")","v":0}]
["qsdIk kIqw jWdw hY ik auprokq drj swry vyrvy skUl irkwrf Anuswr shI Aqy drusq hn[iKfwrI skUl KyfW iv`c Bwg lYx dIAW swrIAW SrqW pUrIAW krdy hn["]
["ijlHw tUrnwmYNt PIs dI rsId dw nM Aqy imqI:- ",null,null,null,null,null,null,null,"sports PMf dI rsId dw nM Aqy imqI:-"]
["tIm ieMcwrj dw nwm Aqy hsqwKr:- ",null,null,null,null,"tIm mYnyjr dw nwm Aqy hsqwKr:-",null,null,null,null,null,"ieMcwrj/ mu`K AiDAwpk/ ipRMsIpl dy hsqwKr Aqy mohr"]

{"sheet":"Blank ","index":5,"n_rows":23,"n_cols":16,"rows_kept":23,"cut":false,"hidden":false,"merged":[[19,0,19,15],[20,0,20,3],[20,4,20,7],[20,8,20,12],[16,9,17,9],[16,10,17,10],[16,11,17,11],[16,12,17,12],[16,13,17,13],[16,14,17,14],[21,0,21,2],[21,3,21,4],[21,5,21,7],[21,8,21,10],[21,11,21,15],[14,12,15,12],[14,13,15,13],[14,14,15,14],[14,15,15,15],[16,0,17,0],[16,1,17,1],[16,5,17,5],[16,6,17,6],[16,7,17,7],[16,8,17,8],[16,15,17,15],[14,8,15,8],[14,9,15,9],[14,10,15,10],[14,11,15,11],[12,11,13,11],[14,0,15,0],[14,1,15,1],[14,5,15,5],[14,6,15,6],[14,7,15,7],[10,12,11,12],[10,13,11,13],[10,14,11,14],[10,15,11,15],[12,0,13,0],[12,1,13,1],[12,5,13,5],[12,6,13,6],[12,7,13,7],[12,8,13,8],[12,15,13,15],[12,12,13,12],[12,13,13,13],[12,14,13,14],[12,9,13,9],[12,10,13,10],[8,15,9,15],[10,0,11,0],[10,1,11,1],[10,5,11,5],[10,6,11,6],[10,7,11,7],[10,8,11,8],[10,9,11,9],[10,10,11,10],[10,11,11,11],[8,9,9,9],[8,10,9,10],[8,11,9,11],[8,12,9,12],[8,13,9,13],[8,14,9,14],[8,0,9,0],[8,1,9,1],[8,5,9,5],[8,6,9,6],[8,7,9,7],[8,8,9,8],[6,10,7,10],[6,11,7,11],[6,12,7,12],[6,13,7,13],[6,14,7,14],[6,15,7,15],[4,0,4,1],[4,10,4,11],[4,12,4,15],[6,0,7,0],[6,1,7,1],[6,5,7,5],[6,6,7,6],[6,7,7,7],[6,8,7,8],[6,9,7,9],[0,0,0,14],[1,0,1,14],[2,0,2,15],[3,0,3,1],[3,2,3,4],[3,11,3,12]]}
["skUl is`iKAw  ivBwg,  pMjwb"]
["67vIAW  pMjwb  rwj  jon p`Dr  skUl KyfW  (luiDAwxw)  2023-24"]
["skUl dw  nwm:-srkwrI hweI skUl KMnw"]
["Kyf  dw  nwm:-",null,null,null,null,null,null,null,null,null,"imqI:- ",null,null,"qoN",null,"q`k"]
["aumr  vrg:- ",null,14,"ਲੜਕੇ",null,null,null,null,null,null,"Kyf  sQwn:"]
["lVI nM","sUtfYt AweIfI","iKfwrI  dw  nwm","ipqw  dw  nwm","mwqw  dw  nwm","ADwr  kwrf","SRyxI","jnm  imqI","dwKlw  nM","skUl  iv`c dwKl  hox dI  imqI","SRyxI  iv`c dwKl  hox dI  imqI","eIvYNt/ Bwr","ipCly  swl ikhVI Kyf/gru`p iv`c  Bwg\nilAw  hY","iKfwrI  dy Gr  dw p`kw  pqw","iKfwrI  dy dsqKq","qsdIk  Sudw  Poto"]
[1]
[]
[2]
[]
[3]
[]
[4]
[]
[5]
[]
[6]
[]
[]
["qsdIk kIqw jWdw hY ik auprokq drj swry vyrvy skUl irkwrf Anuswr shI Aqy drusq hn[iKfwrI skUl KyfW iv`c Bwg lYx dIAW swrIAW SrqW pUrIAW krdy hn["]
["ijlHw tUrnwmYNt PIs dI rsId dw nM Aqy imqI:- ",null,null,null,null,null,null,null,"sports PMf dI rsId dw nM Aqy imqI:-"]
["tIm ieMcwrj dw nwm Aqy hsqwKr:- ",null,null,null,null,"tIm mYnyjr dw nwm Aqy hsqwKr:-",null,null,null,null,null,"ieMcwrj/ mu`K AiDAwpk/ ipRMsIpl dy hsqwKr Aqy mohr"]
[null,"www.teachershelp.in"]